{"text_format":"3","workbook":"xlsx","n_sheets":10,"sheets":["Impressum","Tool","Database_Feedstuffs","Poultry_Needs","Roughage_Forage","PDF_Export","Contribution","List_sheet","About","References"],"not_rendered":{"charts":4,"images":9,"macros":1,"external_links":1,"defined_names":78},"read":"whole","date_system":"1900"}

{"sheet":"Impressum","index":0,"n_rows":0,"n_cols":0,"rows_kept":0}

{"sheet":"Tool","index":1,"n_rows":35,"n_cols":41,"rows_kept":35,"merged":[[2,4,2,6],[2,11,2,17],[3,4,3,6],[3,11,3,17],[4,4,4,6],[4,11,4,17],[5,4,5,6],[5,11,5,17],[6,4,6,6],[6,11,6,17],[7,4,7,6],[8,4,8,6],[9,4,9,6]]}
[]
[]
[{"$nulls":3},"Identity of the farm:",{"$nulls":4},"Select the good scenario",null,null,"Broiler_Broiler_2.6 kg alive at 98 days_3 feeds_3_Finishing_Red clover silage_3"]
[{"$nulls":3},"Farmer's name:",{"$nulls":4},"Feeding phase",null,null,"Finishing"]
[{"$nulls":3},"Date:",{"$nulls":3},{"$f":"TEXT(E5,\"aaaammjj\")","v":"19000100"},"Duration",null,null,{"$f":"_xlfn.IFNA(VLOOKUP($L$12,Requirment[],7,FALSE),\" \")","v":"63-98 day"}]
[{"$nulls":3},"Production:",{"$nulls":4},"This type of feed is used in",null,null,{"$f":"_xlfn.IFNA(VLOOKUP($L$12,Requirment[],8,FALSE),\" \")","v":"France"}]
{"$rows_left_out":30}
{"sheet":"Database_Feedstuffs","index":2,"n_rows":75,"n_cols":39,"rows_kept":75,"merged":[[0,3,0,7],[0,8,0,13],[0,14,0,18],[0,19,0,24],[0,25,0,26],[0,27,0,29],[0,32,0,37]]}
[{"$nulls":3},"Main constituents",{"$nulls":4},"Total Amino Acid",{"$nulls":5},"Fatty Acids",{"$nulls":4},"Minerals ",{"$nulls":5},"Energy",null,"Inclusion levels ",{"$nulls":4},"Digestible Amino acid"]
["Feedstuffs","Matière première","Category","DM %","CP % ","Fiber % ","Fat % ","Ash % ","LYS % ","THR % ","MET % ","CYS % ","MET+CYS % ","TRY % ","C16:0 g/Kg Fat","C18:0 g/Kg Fat","C18:1 g/Kg Fat (Oleic)","C18:2 g/Kg Fat (linoleic)","C18:3 g/Kg Fat (Alpha linolenic)","Ca g/kg ","P g/kg ","Phytate P g/kg ","Mg g/kg ","K g/kg as fed","Na g/kg ","EMAn roaster MJ/Kg ","EMAn broiler MJ/kg ","%  max\n< 28 day broiler","%  max\nbroiler","%  max\n Hen","Avail. P Hen g/kg ","Avail. P broiler g/kg ","DIS LYS poultry % ","DIS THR poultry % ","DIS MET poultry % ","DIS CYS poultry % ","DIS MET+CYS poultry % ","DIS TRY poultry % ","Source "]
["Alfalfa protein concentrate",null,"Other",{"v":92,"d":"92.00"},{"v":49.20000076293945,"d":"49.20"},{"v":2.9000000953674316,"d":"2.90"},{"v":8.199999809265137,"d":"8.20"},{"v":10.100000381469727,"d":"10.10"},{"v":2.9399999618530273,"d":"2.94"},{"v":2.339999961853027,"d":"2.34"},{"v":1,"d":"1.00"},{"v":0.4699999809265137,"d":"0.47"},{"v":1.4699999809265136,"d":"1.47"},0.75,{"v":16.600000381469727,"d":"16.60"},{"v":2.799999952316284,"d":"2.80"},{"v":7.599999904632568,"d":"7.60"},{"v":29.299999237060547,"d":"29.30"},{"v":35.79999923706055,"d":"35.80"},{"v":33.70000076293945,"d":"33.70"},{"v":8.399999618530273,"d":"8.40"},{"v":0.4000000059604645,"d":"0.40"},{"v":1.399999976158142,"d":"1.40"},{"v":7,"d":"7.00"},0.07,{"v":10.96234309623431,"d":"10.96"},{"v":10.96234309623431,"d":"10.96"},{"v":5,"d":"5.00"},{"v":5,"d":"5.00"},{"v":5,"d":"5.00"},null,{"v":6.800000190734863,"d":"6.80"},{"v":2.6299999237060545,"d":"2.63"},{"v":1.9100000381469726,"d":"1.91"},{"v":0.8600000381469727,"d":"0.86"},{"v":0.2700000047683716,"d":"0.27"},{"v":1.1300000190734862,"d":"1.13"},{"v":0.6300000190734864,"d":"0.63"},"Organic table"]
["Alfalfa, dehydrated, protein < 16% ",null,"Dehydrated forage ",{"v":92.5999984741211,"d":"92.60"},{"v":13.600000381469727,"d":"13.60"},{"v":28.899999618530273,"d":"28.90"},{"v":2.200000047683716,"d":"2.20"},{"v":9.5,"d":"9.50"},{"v":0.5199999809265137,"d":"0.52"},{"v":0.45999999046325685,"d":"0.46"},{"v":0.1100000023841858,"d":"0.11"},{"v":0.1899999976158142,"d":"0.19"},{"v":0.3,"d":"0.30"},{"v":0.1899999976158142,"d":"0.19"},{"v":16.600000381469727,"d":"16.60"},{"v":2.799999952316284,"d":"2.80"},{"v":7.599999904632568,"d":"7.60"},{"v":29.299999237060547,"d":"29.30"},{"v":35.79999923706055,"d":"35.80"},{"v":17.700000762939453,"d":"17.70"},{"v":2.4000000953674316,"d":"2.40"},{"v":0.10000000149011612,"d":"0.10"},{"v":1.899999976158142,"d":"1.90"},{"v":23,"d":"23.00"},{"v":0.5600000023841858,"d":"0.56"},{"v":4.7698744769874475,"d":"4.77"},{"v":4.686192468619247,"d":"4.69"},{"v":5,"d":"5.00"},{"v":5,"d":"5.00"},{"v":5,"d":"5.00"},null,null,{"v":0.24000000953674316,"d":"0.24"},{"v":0.20999999046325685,"d":"0.21"},0.05,{"v":0.0800000011920929,"d":"0.08"},{"v":0.12999999523162842,"d":"0.13"},{"v":0.0800000011920929,"d":"0.08"},"Organic table"]
["Alfalfa, dehydrated, protein 16-18% ",null,"Dehydrated forage ",{"v":91.9000015258789,"d":"91.90"},{"v":15.600000381469727,"d":"15.60"},{"v":26.5,"d":"26.50"},{"v":2.200000047683716,"d":"2.20"},{"v":9.800000190734863,"d":"9.80"},{"v":0.6599999904632569,"d":"0.66"},{"v":0.5699999809265137,"d":"0.57"},{"v":0.1600000023841858,"d":"0.16"},{"v":0.2,"d":"0.20"},{"v":0.3599999904632568,"d":"0.36"},{"v":0.2200000047683716,"d":"0.22"},{"v":16.600000381469727,"d":"16.60"},{"v":2.799999952316284,"d":"2.80"},{"v":7.599999904632568,"d":"7.60"},{"v":29.299999237060547,"d":"29.30"},{"v":35.79999923706055,"d":"35.80"},{"v":20.5,"d":"20.50"},{"v":2.299999952316284,"d":"2.30"},{"v":0.10000000149011612,"d":"0.10"},{"v":1.7999999523162842,"d":"1.80"},{"v":23.799999237060547,"d":"23.80"},{"v":0.33000001311302185,"d":"0.33"},{"v":4.853556485355648,"d":"4.85"},{"v":4.7698744769874475,"d":"4.77"},{"v":5,"d":"5.00"},{"v":5,"d":"5.00"},{"v":5,"d":"5.00"},null,null,{"v":0.3700000047683716,"d":"0.37"},{"v":0.3099999904632568,"d":"0.31"},{"v":0.0899999976158142,"d":"0.09"},{"v":0.1,"d":"0.10"},{"v":0.1899999976158142,"d":"0.19"},{"v":0.1100000023841858,"d":"0.11"},"Organic table"]
["Alfalfa, dehydrated, protein 17-19% ",null,"Dehydrated forage ",{"v":92.0999984741211,"d":"92.10"},{"v":16.399999618530273,"d":"16.40"},{"v":25.399999618530273,"d":"25.40"},{"v":2.299999952316284,"d":"2.30"},{"v":10,"d":"10.00"},{"v":0.7199999809265136,"d":"0.72"},{"v":0.6099999904632568,"d":"0.61"},{"v":0.1799999952316284,"d":"0.18"},{"v":0.20999999046325685,"d":"0.21"},{"v":0.3900000095367432,"d":"0.39"},{"v":0.22999999523162842,"d":"0.23"},{"v":16.600000381469727,"d":"16.60"},{"v":2.799999952316284,"d":"2.80"},{"v":7.599999904632568,"d":"7.60"},{"v":29.299999237060547,"d":"29.30"},{"v":35.79999923706055,"d":"35.80"},{"v":18.799999237060547,"d":"18.80"},{"v":2.4000000953674316,"d":"2.40"},{"v":0.10000000149011612,"d":"0.10"},{"v":1.899999976158142,"d":"1.90"},{"v":22.200000762939453,"d":"22.20"},{"v":0.38999998569488525,"d":"0.39"},{"v":4.937238493723849,"d":"4.94"},{"v":4.853556485355648,"d":"4.85"},{"v":5,"d":"5.00"},{"v":5,"d":"5.00"},{"v":5,"d":"5.00"},null,null,{"v":0.4199999809265137,"d":"0.42"},0.35,{"v":0.1100000023841858,"d":"0.11"},{"v":0.1100000023841858,"d":"0.11"},{"v":0.2200000047683716,"d":"0.22"},{"v":0.12999999523162842,"d":"0.13"},"Organic table"]
{"$rows_left_out":70}
{"sheet":"Poultry_Needs","index":3,"n_rows":150,"n_cols":44,"rows_kept":150}
["Obj_reference","Scenarios_reference","Production","Scenarios ","Nb phasis","Formula_Name","Duration","Country","Type of animals to select ration limitation levels","F1_ME Min","F1_CP Min","F1_FAT Min","F1_CF Min","F1_Ca Min","F1_P Min","F1_Na Min","F1 Lys tot min","F1_Lys DIS min","F1_Met tot Max","F1_Met DIS Min","F1_Met+Cys Tot Min","F1_Met+Cys DIS Min","F1_Thr tot Min","F1_Thr DIS Min","F1_try tot Min","F1_try DIS Min","F1_ME Max","F1_CP Max","F1_FAT Max","F1_CF Max","F1_Ca Max","F1_P Max","F1_Na Max","F1_Lys Tot Max ","F1_Lys DIS Max","F1_Met Tot Max2","F1_Met DIS Max","F1_Met+Cys Tot max","F1_Met+Cys DIS Max","F1_Thr tot Max","F1_Thr Max","F1_try tot Max","F1_try DIS Max","Comments "]
[{"$f":"Requirment[[#This Row],[Production]]&\"_\"&Requirment[[#This Row],[Scenarios ]]&\"_\"&Requirment[[#This Row],[Nb phasis]]&\"_\"&Requirment[[#This Row],[Formula_Name]]","v":"Broiler_2.4 Kg alive 63 days_3_Finishing"},{"$f":"Requirment[[#This Row],[Production]]&\"_\"&Requirment[[#This Row],[Scenarios ]]&\"_\"&Requirment[[#This Row],[Nb phasis]]","v":"Broiler_2.4 Kg alive 63 days_3"},"Broiler","2.4 Kg alive 63 days",3,"Finishing","29 - 63 days","Germany","broiler",11.9,17,4,2,0.7,0.5,0.1,{"v":0.7,"d":"0.70"},{"v":0.6306299999999999,"d":"0.63"},{"v":0.3,"d":"0.30"},{"v":0.27026999999999995,"d":"0.27"},{"v":0.5249999999999999,"d":"0.53"},{"v":0.4729724999999999,"d":"0.47"},{"v":0.48999999999999994,"d":"0.49"},{"v":0.4414409999999999,"d":"0.44"},{"v":0.119,"d":"0.12"},{"v":0.1072071,"d":"0.11"},{"v":0.049372384937238493,"d":"0.05"},17,8,2,0.7,0.5,0.1,{"v":0.7,"d":"0.70"},{"v":0.6306299999999999,"d":"0.63"},{"v":0.3,"d":"0.30"},{"v":0.27026999999999995,"d":"0.27"},{"v":0.5249999999999999,"d":"0.53"},{"v":0.4729724999999999,"d":"0.47"},{"v":0.48999999999999994,"d":"0.49"},{"v":0.4414409999999999,"d":"0.44"},{"v":0.119,"d":"0.12"},{"v":0.1072071,"d":"0.11"}]
[{"$f":"Requirment[[#This Row],[Production]]&\"_\"&Requirment[[#This Row],[Scenarios ]]&\"_\"&Requirment[[#This Row],[Nb phasis]]&\"_\"&Requirment[[#This Row],[Formula_Name]]","v":"Broiler_2.4 Kg alive 63 days_3_Growing"},{"$f":"Requirment[[#This Row],[Production]]&\"_\"&Requirment[[#This Row],[Scenarios ]]&\"_\"&Requirment[[#This Row],[Nb phasis]]","v":"Broiler_2.4 Kg alive 63 days_3"},"Broiler","2.4 Kg alive 63 days",3,"Growing","15-28 days","Germany","< 28 day broiler",11.9,19,4,2,0.9,0.7,0.2,{"v":0.9,"d":"0.90"},0.81,{"v":0.3,"d":"0.30"},{"v":0.26999999999999996,"d":"0.27"},{"v":0.68103,"d":"0.68"},{"v":0.6129270000000001,"d":"0.61"},{"v":0.60813,"d":"0.61"},{"v":0.547317,"d":"0.55"},{"v":0.162,"d":"0.16"},{"v":0.1458,"d":"0.15"},11.9,19,8,2,0.9,0.7,0.2,{"v":0.9,"d":"0.90"},0.81,{"v":0.3,"d":"0.30"},{"v":0.26999999999999996,"d":"0.27"},{"v":0.68103,"d":"0.68"},{"v":0.6129270000000001,"d":"0.61"},{"v":0.60813,"d":"0.61"},{"v":0.547317,"d":"0.55"},{"v":0.162,"d":"0.16"},{"v":0.1458,"d":"0.15"}]
[{"$f":"Requirment[[#This Row],[Production]]&\"_\"&Requirment[[#This Row],[Scenarios ]]&\"_\"&Requirment[[#This Row],[Nb phasis]]&\"_\"&Requirment[[#This Row],[Formula_Name]]","v":"Broiler_2.4 Kg alive 63 days_3_Starter"},{"$f":"Requirment[[#This Row],[Production]]&\"_\"&Requirment[[#This Row],[Scenarios ]]&\"_\"&Requirment[[#This Row],[Nb phasis]]","v":"Broiler_2.4 Kg alive 63 days_3"},"Broiler","2.4 Kg alive 63 days",3,"Starter","0-14","Germany","< 28 day broiler",11.9,21,4,2,0.9,0.7,0.2,{"v":1,"d":"1.00"},{"v":0.9037000000000001,"d":"0.90"},{"v":0.3,"d":"0.30"},{"v":0.27111,"d":"0.27"},{"v":0.7555999999999999,"d":"0.76"},{"v":0.68283572,"d":"0.68"},{"v":0.6667000000000001,"d":"0.67"},{"v":0.6024967900000001,"d":"0.60"},{"v":0.16670000000000001,"d":"0.17"},{"v":0.15064679000000003,"d":"0.15"},11.9,21,4,2,0.9,0.7,0.2,{"v":1,"d":"1.00"},{"v":0.9037000000000001,"d":"0.90"},{"v":0.3,"d":"0.30"},{"v":0.27111,"d":"0.27"},{"v":0.7555999999999999,"d":"0.76"},{"v":0.68283572,"d":"0.68"},{"v":0.6667000000000001,"d":"0.67"},{"v":0.6024967900000001,"d":"0.60"},{"v":0.16670000000000001,"d":"0.17"},{"v":0.15064679000000003,"d":"0.15"}]
[{"$f":"Requirment[[#This Row],[Production]]&\"_\"&Requirment[[#This Row],[Scenarios ]]&\"_\"&Requirment[[#This Row],[Nb phasis]]&\"_\"&Requirment[[#This Row],[Formula_Name]]","v":"Broiler_2.6 kg alive at 112 days_2 feeds_3_Finishing"},{"$f":"Requirment[[#This Row],[Production]]&\"_\"&Requirment[[#This Row],[Scenarios ]]&\"_\"&Requirment[[#This Row],[Nb phasis]]","v":"Broiler_2.6 kg alive at 112 days_2 feeds_3"},"Broiler","2.6 kg alive at 112 days_2 feeds",3,"Finishing","63-112 days","France","broiler",{"v":11.297071129707113,"d":"11.3"},14,2,0,0.7,0.3,0.15,{"v":0.7215007215007214,"d":"0.72"},0.65,{"v":0.27750027750027745,"d":"0.28"},0.25,{"v":0.5439005439005439,"d":"0.54"},0.49,{"v":0.5439005439005439,"d":"0.54"},0.49,{"v":0.1332001332001332,"d":"0.13"},0.12,{"v":11.715481171548117,"d":"11.7"},16,7,7,0.8,0.35,0.18,{"v":0.8325008325008325,"d":"0.83"},0.75,{"v":0.3885003885003885,"d":"0.39"},0.35,{"v":0.6549006549006549,"d":"0.65"},0.59,{"v":0.7659007659007658,"d":"0.77"},0.69,{"v":0.3552003552003552,"d":"0.36"},0.32]
[{"$f":"Requirment[[#This Row],[Production]]&\"_\"&Requirment[[#This Row],[Scenarios ]]&\"_\"&Requirment[[#This Row],[Nb phasis]]&\"_\"&Requirment[[#This Row],[Formula_Name]]","v":"Broiler_2.6 kg alive at 112 days_2 feeds_3_Growing"},{"$f":"Requirment[[#This Row],[Production]]&\"_\"&Requirment[[#This Row],[Scenarios ]]&\"_\"&Requirment[[#This Row],[Nb phasis]]","v":"Broiler_2.6 kg alive at 112 days_2 feeds_3"},"Broiler","2.6 kg alive at 112 days_2 feeds",3,"Growing","28-63 day","France","broiler",{"v":11.715481171548117,"d":"11.7"},17,2,0,0.9,0.4,0.15,{"v":0.8222222222222222,"d":"0.82"},0.74,{"v":0.3333333333333333,"d":"0.33"},0.3,{"v":0.6222222222222222,"d":"0.62"},0.56,{"v":0.5555555555555555,"d":"0.56"},0.5,{"v":0.17777777777777778,"d":"0.18"},0.16,{"v":12.133891213389122,"d":"12.1"},19,7,7,1,0.45,0.18,{"v":0.9333333333333333,"d":"0.93"},0.84,{"v":0.4444444444444445,"d":"0.44"},{"v":0.4,"d":"0.40"},{"v":0.7333333333333334,"d":"0.73"},0.66,{"v":0.7777777777777777,"d":"0.78"},{"v":0.7,"d":"0.70"},{"v":0.39999999999999997,"d":"0.40"},0.36]
{"$rows_left_out":145}
{"sheet":"Roughage_Forage","index":4,"n_rows":31,"n_cols":42,"rows_kept":31,"merged":[[1,2,1,5],[1,11,1,13],[1,14,1,19],[2,2,2,5],[2,11,2,13],[2,14,2,19],[3,2,3,5],[3,11,3,13],[3,14,3,19],[4,2,4,5],[4,11,4,13],[4,14,4,19],[5,2,5,5],[5,11,5,13],[5,14,5,19],[6,2,6,5],[7,2,7,5],[8,2,8,5],[20,2,20,3],[21,2,21,3],[23,2,23,3],[25,2,25,3],[26,2,26,3],[27,2,27,3]]}
[]
["STEP 1 : Feeding scenario","Identity of the farm:","Example",{"$nulls":8},"Select the good scenario",null,null,"Broiler_2.6 kg alive at 98 days_3 feeds_3"]
[null,"Farmer's name:","Example",{"$nulls":8},"Feeding phase",null,null,"Finishing"]
[null,"Date:","2021-02-01",{"$nulls":3},{"$f":"TEXT(C4,\"aaaammjj\")","v":"20210201"},{"$nulls":4},"Duration",null,null,{"$f":"_xlfn.IFNA(VLOOKUP($O$9,Requirment[],7,FALSE),)","v":"63-98 day"}]
[null,"Production:","Broiler",{"$nulls":8},"This type of feed is used in",null,null,{"$f":"_xlfn.IFNA(VLOOKUP($O$9,Requirment[],8,FALSE),)","v":"France"}]
[null,"Poultry Flocks",15,{"$nulls":8},"Category of animals",null,null,{"$f":"_xlfn.IFNA(VLOOKUP($O$9,Requirment[],9,FALSE),)","v":"broiler"}]
{"$rows_left_out":26}
{"sheet":"PDF_Export","index":5,"n_rows":53,"n_cols":6,"rows_kept":53}
[{"$f":"CONCATENATE(\"RATION REALIZED ON: \"&TEXT(Tool!E5,\"jj/mm/aaaa\"))","v":"RATION REALIZED ON: 00/01/1900"}]
[]
["Context:"]
[{"$f":"Tool!D3","v":"Identity of the farm:"},{"$f":"IF(Tool!E3<>\"\",Tool!E3,\"\")","v":""}]
[{"$f":"Tool!D4","v":"Farmer's name:"},{"$f":"IF(Tool!E4<>\"\",Tool!E4,\"\")","v":""}]
[{"$f":"Tool!D6","v":"Production:"},{"$f":"IF(Tool!E6<>\"\",Tool!E6,\"\")","v":""}]
{"$rows_left_out":48}
{"sheet":"Contribution","index":6,"n_rows":14,"n_cols":8,"rows_kept":14,"hidden":true}
["Feedstuffs - ME","% of contribution off each feedstuff for Energy","Feedstuffs CP","% of contribution off each feedstuff for Proteins","Feedstuffs LYS","% of contribution off each feedstuff for Lysine","Feedstuffs MET","% of contribution off each feedstuff for Methionine"]
[{"$f":"IF(B2<>0,Tool!D14,\"\")","v":{"$error":"#DIV/0!"}},{"$f":"Tool!G14*Tool!F14/Tool!$G$27","v":{"$error":"#DIV/0!"}},{"$f":"IF(D2<>0,Tool!D14,\"\")","v":{"$error":"#DIV/0!"}},{"$f":"Tool!H14*Tool!F14/Tool!$H$27","v":{"$error":"#DIV/0!"}},{"$f":"IF(F2<>0,Tool!D14,\"\")","v":{"$error":"#DIV/0!"}},{"$f":"Tool!K14*Tool!F14/Tool!$K$27","v":{"$error":"#DIV/0!"}},{"$f":"IF(H2<>0,Tool!D14,\"\")","v":{"$error":"#DIV/0!"}},{"$f":"Tool!L14*Tool!F14/Tool!$L$27","v":{"$error":"#DIV/0!"}}]
[{"$f":"IF(B3<>0,Tool!D15,\"\")","v":{"$error":"#DIV/0!"}},{"$f":"Tool!G15*Tool!F15/Tool!$G$27","v":{"$error":"#DIV/0!"}},{"$f":"IF(D3<>0,Tool!D15,\"\")","v":{"$error":"#DIV/0!"}},{"$f":"Tool!H15*Tool!F15/Tool!$H$27","v":{"$error":"#DIV/0!"}},{"$f":"IF(F3<>0,Tool!D15,\"\")","v":{"$error":"#DIV/0!"}},{"$f":"Tool!K15*Tool!F15/Tool!$K$27","v":{"$error":"#DIV/0!"}},{"$f":"IF(H3<>0,Tool!D15,\"\")","v":{"$error":"#DIV/0!"}},{"$f":"Tool!L15*Tool!F15/Tool!$L$27","v":{"$error":"#DIV/0!"}}]
[{"$f":"IF(B4<>0,Tool!D16,\"\")","v":{"$error":"#DIV/0!"}},{"$f":"Tool!G16*Tool!F16/Tool!$G$27","v":{"$error":"#DIV/0!"}},{"$f":"IF(D4<>0,Tool!D16,\"\")","v":{"$error":"#DIV/0!"}},{"$f":"Tool!H16*Tool!F16/Tool!$H$27","v":{"$error":"#DIV/0!"}},{"$f":"IF(F4<>0,Tool!D16,\"\")","v":{"$error":"#DIV/0!"}},{"$f":"Tool!K16*Tool!F16/Tool!$K$27","v":{"$error":"#DIV/0!"}},{"$f":"IF(H4<>0,Tool!D16,\"\")","v":{"$error":"#DIV/0!"}},{"$f":"Tool!L16*Tool!F16/Tool!$L$27","v":{"$error":"#DIV/0!"}}]
[{"$f":"IF(B5<>0,Tool!D17,\"\")","v":{"$error":"#DIV/0!"}},{"$f":"Tool!G17*Tool!F17/Tool!$G$27","v":{"$error":"#DIV/0!"}},{"$f":"IF(D5<>0,Tool!D17,\"\")","v":{"$error":"#DIV/0!"}},{"$f":"Tool!H17*Tool!F17/Tool!$H$27","v":{"$error":"#DIV/0!"}},{"$f":"IF(F5<>0,Tool!D17,\"\")","v":{"$error":"#DIV/0!"}},{"$f":"Tool!K17*Tool!F17/Tool!$K$27","v":{"$error":"#DIV/0!"}},{"$f":"IF(H5<>0,Tool!D17,\"\")","v":{"$error":"#DIV/0!"}},{"$f":"Tool!L17*Tool!F17/Tool!$L$27","v":{"$error":"#DIV/0!"}}]
[{"$f":"IF(B6<>0,Tool!D18,\"\")","v":{"$error":"#DIV/0!"}},{"$f":"Tool!G18*Tool!F18/Tool!$G$27","v":{"$error":"#DIV/0!"}},{"$f":"IF(D6<>0,Tool!D18,\"\")","v":{"$error":"#DIV/0!"}},{"$f":"Tool!H18*Tool!F18/Tool!$H$27","v":{"$error":"#DIV/0!"}},{"$f":"IF(F6<>0,Tool!D18,\"\")","v":{"$error":"#DIV/0!"}},{"$f":"Tool!K18*Tool!F18/Tool!$K$27","v":{"$error":"#DIV/0!"}},{"$f":"IF(H6<>0,Tool!D18,\"\")","v":{"$error":"#DIV/0!"}},{"$f":"Tool!L18*Tool!F18/Tool!$L$27","v":{"$error":"#DIV/0!"}}]
{"$rows_left_out":9}
{"sheet":"List_sheet","index":7,"n_rows":100,"n_cols":12,"rows_kept":100,"hidden":true}
["Value scenarios","Ligne","Ligne filtrée","Ligne triee","Liste unique scenarios","Valeur formula","Ligne","Ligne filtrée","Ligne triee","Liste unique Formula"]
[{"$f":"IFERROR(Requirment[[#This Row],[Scenarios_reference]],\"\")","v":"Broiler_2.4 Kg alive 63 days_3"},{"$f":"ROW()-1","v":1},{"$f":"IF(COUNTIF($A$2:A2,A2)=1,ROW()-1,\"\")","v":1},{"$f":"IFERROR(SMALL(C:C,B2),\"\")","v":1},{"$f":"IFERROR(INDEX($A$2:$A$99,D2),\"\")","v":"Broiler_2.4 Kg alive 63 days_3"},{"$f":"IFERROR(Requirment[[#This Row],[Formula_Name]],\"\")","v":"Finishing"},{"$f":"ROW()-1","v":1},{"$f":"IF(COUNTIF($F$2:F2,F2)=1,ROW()-1,\"\")","v":1},{"$f":"IFERROR(SMALL(H:H,G2),\"\")","v":1},{"$f":"IFERROR(INDEX($F$2:$F$99,I2),\"\")","v":"Finishing"}]
[{"$f":"IFERROR(Requirment[[#This Row],[Scenarios_reference]],\"\")","v":"Broiler_2.4 Kg alive 63 days_3"},{"$f":"ROW()-1","v":2},{"$f":"IF(COUNTIF($A$2:A3,A3)=1,ROW()-1,\"\")","v":""},{"$f":"IFERROR(SMALL(C:C,B3),\"\")","v":4},{"$f":"IFERROR(INDEX($A$2:$A$99,D3),\"\")","v":"Broiler_2.6 kg alive at 112 days_2 feeds_3"},{"$f":"IFERROR(Requirment[[#This Row],[Formula_Name]],\"\")","v":"Growing"},{"$f":"ROW()-1","v":2},{"$f":"IF(COUNTIF($F$2:F3,F3)=1,ROW()-1,\"\")","v":2},{"$f":"IFERROR(SMALL(H:H,G3),\"\")","v":2},{"$f":"IFERROR(INDEX($F$2:$F$99,I3),\"\")","v":"Growing"}]
[{"$f":"IFERROR(Requirment[[#This Row],[Scenarios_reference]],\"\")","v":"Broiler_2.4 Kg alive 63 days_3"},3,{"$f":"IF(COUNTIF($A$2:A4,A4)=1,ROW()-1,\"\")","v":""},7,"Broiler_2.6 kg alive at 126 days_3 feeds_3",{"$f":"IFERROR(Requirment[[#This Row],[Formula_Name]],\"\")","v":"Starter"},3,{"$f":"IF(COUNTIF($F$2:F4,F4)=1,ROW()-1,\"\")","v":3},3,"Starter",null,"Protection feuille:"]
[{"$f":"IFERROR(Requirment[[#This Row],[Scenarios_reference]],\"\")","v":"Broiler_2.6 kg alive at 112 days_2 feeds_3"},4,{"$f":"IF(COUNTIF($A$2:A5,A5)=1,ROW()-1,\"\")","v":4},10,"Broiler_2.6 kg alive at 126 days_4 feeds_4",{"$f":"IFERROR(Requirment[[#This Row],[Formula_Name]],\"\")","v":"Finishing"},4,{"$f":"IF(COUNTIF($F$2:F5,F5)=1,ROW()-1,\"\")","v":""},10,"Finishing 1",null,"ITAB"]
[{"$f":"IFERROR(Requirment[[#This Row],[Scenarios_reference]],\"\")","v":"Broiler_2.6 kg alive at 112 days_2 feeds_3"},5,{"$f":"IF(COUNTIF($A$2:A6,A6)=1,ROW()-1,\"\")","v":""},14,"Broiler_2.6 kg alive at 98 days_2 feeds_2",{"$f":"IFERROR(Requirment[[#This Row],[Formula_Name]],\"\")","v":"Growing"},5,{"$f":"IF(COUNTIF($F$2:F6,F6)=1,ROW()-1,\"\")","v":""},11,"Finishing 2"]
{"$rows_left_out":95}
{"sheet":"About","index":8,"n_rows":0,"n_cols":0,"rows_kept":0}

{"sheet":"References","index":9,"n_rows":0,"n_cols":0,"rows_kept":0}