{"text_format":"3","workbook":"xlsx","n_sheets":10,"sheets":["Impressum","Tool","Database_Feedstuffs","Poultry_Needs","Roughage_Forage","PDF_Export","Contribution","List_sheet","About","References"],"not_rendered":{"charts":4,"images":9,"macros":1,"external_links":1,"defined_names":78},"read":"whole","date_system":"1900"}

{"sheet":"Impressum","index":0,"n_rows":0,"n_cols":0,"rows_kept":0}

{"sheet":"Tool","index":1,"n_rows":35,"n_cols":41,"rows_kept":35,"merged":[[2,4,2,6],[2,11,2,17],[3,4,3,6],[3,11,3,17],[4,4,4,6],[4,11,4,17],[5,4,5,6],[5,11,5,17],[6,4,6,6],[6,11,6,17],[7,4,7,6],[8,4,8,6],[9,4,9,6]]}
[]
[]
[{"$nulls":3},"Identity of the farm:",{"$nulls":4},"Select the good scenario",null,null,"Broiler_Broiler_2.6 kg alive at 98 days_3 feeds_3_Finishing_Red clover silage_3"]
[{"$nulls":3},"Farmer's name:",{"$nulls":4},"Feeding phase",null,null,"Finishing"]
[{"$nulls":3},"Date:",{"$nulls":3},{"$f":"TEXT(E5,\"aaaammjj\")","v":"19000100"},"Duration",null,null,{"$f":"_xlfn.IFNA(VLOOKUP($L$12,Requirment[],7,FALSE),\" \")","v":"63-98 day"}]
[{"$nulls":3},"Production:",{"$nulls":4},"This type of feed is used in",null,null,{"$f":"_xlfn.IFNA(VLOOKUP($L$12,Requirment[],8,FALSE),\" \")","v":"France"}]
[{"$nulls":3},"Poultry Flocks",{"$nulls":4},"Category of animals",null,null,{"$f":"_xlfn.IFNA(VLOOKUP($L$12,Requirment[],9,FALSE),\" \")","v":"broiler"}]
[{"$nulls":3},"Objectives (kg, days)",{"$nulls":7},{"$f":"IF(L11=0,\"SCENARIO NOT AVAILABLE\",\"\")","v":""}]
[{"$nulls":3},"Number of  feed phases ",{"$nulls":18}," "]
[{"$nulls":3},"Type of animals"]
[{"$nulls":3},"Total ration weight: ",null,"Kg (Grinder capacity)",{"$nulls":5},{"$f":"COUNTIF(Poultry_Needs!A:A,Tool!L12)","v":1}]
[{"$nulls":11},{"$f":"L3&\"_\"&L4","v":"Broiler_Broiler_2.6 kg alive at 98 days_3 feeds_3_Finishing_Red clover silage_3_Finishing"}]
[{"$nulls":3},"Feedstuffs","Kg","%","ME roaster MJ/Kg","CP % ","Fat % ","Fiber % ","LYS %","MET % ","MET+CYS %","THR % ","TRY % ","DIS LYS poultry % ","DIS MET poultry % ","DIS MET+CYS poultry % ","DIS THR poultry % raw","DIS TRY poultry % raw","Ca g/kg Raw","P g/kg Raw","Na g/kg Raw",null,"Min",{"$f":"CONCATENATE(\"Ration limitation level \",L7)","v":"Ration limitation level broiler"},"TAKE CARE OF",null,"Feedstuffs costs (€/T)","Ration Costs (€)","% of cost",null,"C16:0 % Fat","C18:0 % Fat","C18:1 % Fat (Oleic)","C18:2 % Fat (linoleic)","C18:3 % Fat (Alpha linolenic)","Mg g/kg Raw","K g/kg as fed","Avail. P Hen g/kg brut","Avail. P broiler g/kg brut"]
[null,null,1,null,{"$f":"_xlfn.IFNA($E$11*F14/100,0)","v":{"v":0,"d":"0.00"}},{"v":0,"d":"0.00"},{"$f":"_xlfn.IFNA(VLOOKUP(D14,Feedstuff[],26,FALSE),0)","v":{"v":0,"d":"0.00"}},{"$f":"_xlfn.IFNA(VLOOKUP(D14,Feedstuff[],5,FALSE),0)","v":{"v":0,"d":"0.00"}},{"$f":"_xlfn.IFNA(VLOOKUP(D14,Feedstuff[],7,FALSE),0)","v":{"v":0,"d":"0.00"}},{"$f":"_xlfn.IFNA(VLOOKUP(D14,Feedstuff[],6,FALSE),0)","v":{"v":0,"d":"0.00"}},{"$f":"_xlfn.IFNA(VLOOKUP(D14,Feedstuff[],9,FALSE),0)","v":{"v":0,"d":"0.00"}},{"$f":"_xlfn.IFNA(VLOOKUP(D14,Feedstuff[],11,FALSE),0)","v":{"v":0,"d":"0.00"}},{"$f":"_xlfn.IFNA(VLOOKUP(D14,Feedstuff[],13,FALSE),0)","v":{"v":0,"d":"0.00"}},{"$f":"_xlfn.IFNA(VLOOKUP(D14,Feedstuff[],10,FALSE),0)","v":{"v":0,"d":"0.00"}},{"$f":"_xlfn.IFNA(VLOOKUP(D14,Feedstuff[],14,FALSE),0)","v":{"v":0,"d":"0.00"}},{"$f":"_xlfn.IFNA(VLOOKUP(D14,Feedstuff[],33,FALSE),0)","v":{"v":0,"d":"0.00"}},{"$f":"_xlfn.IFNA(VLOOKUP(D14,Feedstuff[],35,FALSE),0)","v":{"v":0,"d":"0.00"}},{"$f":"_xlfn.IFNA(VLOOKUP(D14,Feedstuff[],37,FALSE),0)","v":{"v":0,"d":"0.00"}},{"$f":"_xlfn.IFNA(VLOOKUP(D14,Feedstuff[],34,FALSE),0)","v":{"v":0,"d":"0.00"}},{"$f":"_xlfn.IFNA(VLOOKUP(D14,Feedstuff[],38,FALSE),0)","v":{"v":0,"d":"0.00"}},{"$f":"_xlfn.IFNA(VLOOKUP(D14,Feedstuff[],20,FALSE),0)","v":{"v":0,"d":"0.00"}},{"$f":"_xlfn.IFNA(VLOOKUP(D14,Feedstuff[],21,FALSE),0)","v":{"v":0,"d":"0.00"}},{"$f":"_xlfn.IFNA(VLOOKUP(D14,Feedstuff[],25,FALSE),)","v":{"v":0,"d":"0.00"}},null,null,{"$f":"_xlfn.IFNA(IF($L$7=\"< 28 day broiler\",(VLOOKUP(D14,Feedstuff[],28,FALSE)),IF($L$7=\"broiler\",(VLOOKUP(D14,Feedstuff[],29,FALSE)),IF($L$7=\"Hen\",(VLOOKUP(D14,Feedstuff[],30,FALSE)),0))),\"0\")","v":"0"},{"$f":"IF(D14<>\"\",IF($E$13=\"%\",IF(E14>Z14,\"SUP\",IF(E14=Z14,\"MAX\",\"OK\")),IF(F14>Z14,\"SUP\",IF(F14=Z14,\"MAX\",\"OK\"))),\"\")","v":""},null,null,{"$f":"E14*AC14/1000","v":0},{"$f":"F14*AC14/$AD$29","v":{"$error":"#DIV/0!"}},null,{"$f":"_xlfn.IFNA(VLOOKUP(D14,Feedstuff[],15,FALSE),0)","v":{"v":0,"d":"0.00"}},{"$f":"_xlfn.IFNA(VLOOKUP(D13,Feedstuff[],16,FALSE),0)","v":{"v":0,"d":"0.00"}},{"$f":"_xlfn.IFNA(VLOOKUP(D14,Feedstuff[],17,FALSE),0)","v":{"v":0,"d":"0.00"}},{"$f":"_xlfn.IFNA(VLOOKUP(D14,Feedstuff[],18,FALSE),0)","v":{"v":0,"d":"0.00"}},{"$f":"_xlfn.IFNA(VLOOKUP(D14,Feedstuff[],19,FALSE),0)","v":{"v":0,"d":"0.00"}},{"$f":"_xlfn.IFNA(VLOOKUP(D14,Feedstuff[],23,FALSE),0)","v":{"v":0,"d":"0.00"}},{"$f":"_xlfn.IFNA(VLOOKUP(D14,Feedstuff[],24,FALSE),0)","v":{"v":0,"d":"0.00"}},{"$f":"_xlfn.IFNA(VLOOKUP(D14,Feedstuff[],31,FALSE),0)","v":{"v":0,"d":"0.00"}},{"$f":"_xlfn.IFNA(VLOOKUP(D14,Feedstuff[],32,FALSE),0)","v":{"v":0,"d":"0.00"}}]
[null,null,2,null,{"$f":"_xlfn.IFNA($E$11*F15/100,0)","v":{"v":0,"d":"0.00"}},{"v":0,"d":"0.00"},{"$f":"_xlfn.IFNA(VLOOKUP(D15,Feedstuff[],26,FALSE),0)","v":{"v":0,"d":"0.00"}},{"$f":"_xlfn.IFNA(VLOOKUP(D15,Feedstuff[],5,FALSE),0)","v":{"v":0,"d":"0.00"}},{"$f":"_xlfn.IFNA(VLOOKUP(D15,Feedstuff[],7,FALSE),0)","v":{"v":0,"d":"0.00"}},{"$f":"_xlfn.IFNA(VLOOKUP(D15,Feedstuff[],6,FALSE),0)","v":{"v":0,"d":"0.00"}},{"$f":"_xlfn.IFNA(VLOOKUP(D15,Feedstuff[],9,FALSE),0)","v":{"v":0,"d":"0.00"}},{"$f":"_xlfn.IFNA(VLOOKUP(D15,Feedstuff[],11,FALSE),0)","v":{"v":0,"d":"0.00"}},{"$f":"_xlfn.IFNA(VLOOKUP(D15,Feedstuff[],13,FALSE),0)","v":{"v":0,"d":"0.00"}},{"$f":"_xlfn.IFNA(VLOOKUP(D15,Feedstuff[],10,FALSE),0)","v":{"v":0,"d":"0.00"}},{"$f":"_xlfn.IFNA(VLOOKUP(D15,Feedstuff[],14,FALSE),0)","v":{"v":0,"d":"0.00"}},{"$f":"_xlfn.IFNA(VLOOKUP(D15,Feedstuff[],33,FALSE),0)","v":{"v":0,"d":"0.00"}},{"$f":"_xlfn.IFNA(VLOOKUP(D15,Feedstuff[],35,FALSE),0)","v":{"v":0,"d":"0.00"}},{"$f":"_xlfn.IFNA(VLOOKUP(D15,Feedstuff[],37,FALSE),0)","v":{"v":0,"d":"0.00"}},{"$f":"_xlfn.IFNA(VLOOKUP(D15,Feedstuff[],34,FALSE),0)","v":{"v":0,"d":"0.00"}},{"$f":"_xlfn.IFNA(VLOOKUP(D15,Feedstuff[],38,FALSE),0)","v":{"v":0,"d":"0.00"}},{"$f":"_xlfn.IFNA(VLOOKUP(D15,Feedstuff[],20,FALSE),0)","v":{"v":0,"d":"0.00"}},{"$f":"_xlfn.IFNA(VLOOKUP(D15,Feedstuff[],21,FALSE),0)","v":{"v":0,"d":"0.00"}},{"$f":"_xlfn.IFNA(VLOOKUP(D15,Feedstuff[],25,FALSE),)","v":{"v":0,"d":"0.00"}},null,null,{"$f":"_xlfn.IFNA(IF($L$7=\"< 28 day broiler\",(VLOOKUP(D15,Feedstuff[],28,FALSE)),IF($L$7=\"broiler\",(VLOOKUP(D15,Feedstuff[],29,FALSE)),IF($L$7=\"Hen\",(VLOOKUP(D15,Feedstuff[],30,FALSE)),0))),\"0\")","v":"0"},"",null,null,{"$f":"E15*AC15/1000","v":0},{"$f":"F15*AC15/$AD$29","v":{"$error":"#DIV/0!"}},null,{"$f":"_xlfn.IFNA(VLOOKUP(D15,Feedstuff[],15,FALSE),0)","v":{"v":0,"d":"0.00"}},{"$f":"_xlfn.IFNA(VLOOKUP(D14,Feedstuff[],16,FALSE),0)","v":{"v":0,"d":"0.00"}},{"$f":"_xlfn.IFNA(VLOOKUP(D15,Feedstuff[],17,FALSE),0)","v":{"v":0,"d":"0.00"}},{"$f":"_xlfn.IFNA(VLOOKUP(D15,Feedstuff[],18,FALSE),0)","v":{"v":0,"d":"0.00"}},{"$f":"_xlfn.IFNA(VLOOKUP(D15,Feedstuff[],19,FALSE),0)","v":{"v":0,"d":"0.00"}},{"$f":"_xlfn.IFNA(VLOOKUP(D15,Feedstuff[],23,FALSE),0)","v":{"v":0,"d":"0.00"}},{"$f":"_xlfn.IFNA(VLOOKUP(D15,Feedstuff[],24,FALSE),0)","v":{"v":0,"d":"0.00"}},{"$f":"_xlfn.IFNA(VLOOKUP(D15,Feedstuff[],31,FALSE),0)","v":{"v":0,"d":"0.00"}},{"$f":"_xlfn.IFNA(VLOOKUP(D15,Feedstuff[],32,FALSE),0)","v":{"v":0,"d":"0.00"}}]
[null,null,3,null,{"v":0,"d":"0.00"},{"v":0,"d":"0.00"},{"$f":"_xlfn.IFNA(VLOOKUP(D16,Feedstuff[],26,FALSE),0)","v":{"v":0,"d":"0.00"}},{"$f":"_xlfn.IFNA(VLOOKUP(D16,Feedstuff[],5,FALSE),0)","v":{"v":0,"d":"0.00"}},{"$f":"_xlfn.IFNA(VLOOKUP(D16,Feedstuff[],7,FALSE),0)","v":{"v":0,"d":"0.00"}},{"$f":"_xlfn.IFNA(VLOOKUP(D16,Feedstuff[],6,FALSE),0)","v":{"v":0,"d":"0.00"}},{"$f":"_xlfn.IFNA(VLOOKUP(D16,Feedstuff[],9,FALSE),0)","v":{"v":0,"d":"0.00"}},{"$f":"_xlfn.IFNA(VLOOKUP(D16,Feedstuff[],11,FALSE),0)","v":{"v":0,"d":"0.00"}},{"$f":"_xlfn.IFNA(VLOOKUP(D16,Feedstuff[],13,FALSE),0)","v":{"v":0,"d":"0.00"}},{"$f":"_xlfn.IFNA(VLOOKUP(D16,Feedstuff[],10,FALSE),0)","v":{"v":0,"d":"0.00"}},{"$f":"_xlfn.IFNA(VLOOKUP(D16,Feedstuff[],14,FALSE),0)","v":{"v":0,"d":"0.00"}},{"$f":"_xlfn.IFNA(VLOOKUP(D16,Feedstuff[],33,FALSE),0)","v":{"v":0,"d":"0.00"}},{"$f":"_xlfn.IFNA(VLOOKUP(D16,Feedstuff[],35,FALSE),0)","v":{"v":0,"d":"0.00"}},{"$f":"_xlfn.IFNA(VLOOKUP(D16,Feedstuff[],37,FALSE),0)","v":{"v":0,"d":"0.00"}},{"$f":"_xlfn.IFNA(VLOOKUP(D16,Feedstuff[],34,FALSE),0)","v":{"v":0,"d":"0.00"}},{"$f":"_xlfn.IFNA(VLOOKUP(D16,Feedstuff[],38,FALSE),0)","v":{"v":0,"d":"0.00"}},{"$f":"_xlfn.IFNA(VLOOKUP(D16,Feedstuff[],20,FALSE),0)","v":{"v":0,"d":"0.00"}},{"$f":"_xlfn.IFNA(VLOOKUP(D16,Feedstuff[],21,FALSE),0)","v":{"v":0,"d":"0.00"}},{"$f":"_xlfn.IFNA(VLOOKUP(D16,Feedstuff[],25,FALSE),)","v":{"v":0,"d":"0.00"}},null,null,{"$f":"_xlfn.IFNA(IF($L$7=\"< 28 day broiler\",(VLOOKUP(D16,Feedstuff[],28,FALSE)),IF($L$7=\"broiler\",(VLOOKUP(D16,Feedstuff[],29,FALSE)),IF($L$7=\"Hen\",(VLOOKUP(D16,Feedstuff[],30,FALSE)),0))),\"0\")","v":"0"},"",null,null,0,{"$error":"#DIV/0!"},null,{"$f":"_xlfn.IFNA(VLOOKUP(D16,Feedstuff[],15,FALSE),0)","v":{"v":0,"d":"0.00"}},{"$f":"_xlfn.IFNA(VLOOKUP(D15,Feedstuff[],16,FALSE),0)","v":{"v":0,"d":"0.00"}},{"$f":"_xlfn.IFNA(VLOOKUP(D16,Feedstuff[],17,FALSE),0)","v":{"v":0,"d":"0.00"}},{"$f":"_xlfn.IFNA(VLOOKUP(D16,Feedstuff[],18,FALSE),0)","v":{"v":0,"d":"0.00"}},{"$f":"_xlfn.IFNA(VLOOKUP(D16,Feedstuff[],19,FALSE),0)","v":{"v":0,"d":"0.00"}},{"$f":"_xlfn.IFNA(VLOOKUP(D16,Feedstuff[],23,FALSE),0)","v":{"v":0,"d":"0.00"}},{"$f":"_xlfn.IFNA(VLOOKUP(D16,Feedstuff[],24,FALSE),0)","v":{"v":0,"d":"0.00"}},{"$f":"_xlfn.IFNA(VLOOKUP(D16,Feedstuff[],31,FALSE),0)","v":{"v":0,"d":"0.00"}},{"$f":"_xlfn.IFNA(VLOOKUP(D16,Feedstuff[],32,FALSE),0)","v":{"v":0,"d":"0.00"}}]
[null,null,4,null,{"v":0,"d":"0.00"},{"v":0,"d":"0.00"},{"$f":"_xlfn.IFNA(VLOOKUP(D17,Feedstuff[],26,FALSE),0)","v":{"v":0,"d":"0.00"}},{"$f":"_xlfn.IFNA(VLOOKUP(D17,Feedstuff[],5,FALSE),0)","v":{"v":0,"d":"0.00"}},{"$f":"_xlfn.IFNA(VLOOKUP(D17,Feedstuff[],7,FALSE),0)","v":{"v":0,"d":"0.00"}},{"$f":"_xlfn.IFNA(VLOOKUP(D17,Feedstuff[],6,FALSE),0)","v":{"v":0,"d":"0.00"}},{"$f":"_xlfn.IFNA(VLOOKUP(D17,Feedstuff[],9,FALSE),0)","v":{"v":0,"d":"0.00"}},{"$f":"_xlfn.IFNA(VLOOKUP(D17,Feedstuff[],11,FALSE),0)","v":{"v":0,"d":"0.00"}},{"$f":"_xlfn.IFNA(VLOOKUP(D17,Feedstuff[],13,FALSE),0)","v":{"v":0,"d":"0.00"}},{"$f":"_xlfn.IFNA(VLOOKUP(D17,Feedstuff[],10,FALSE),0)","v":{"v":0,"d":"0.00"}},{"$f":"_xlfn.IFNA(VLOOKUP(D17,Feedstuff[],14,FALSE),0)","v":{"v":0,"d":"0.00"}},{"$f":"_xlfn.IFNA(VLOOKUP(D17,Feedstuff[],33,FALSE),0)","v":{"v":0,"d":"0.00"}},{"$f":"_xlfn.IFNA(VLOOKUP(D17,Feedstuff[],35,FALSE),0)","v":{"v":0,"d":"0.00"}},{"$f":"_xlfn.IFNA(VLOOKUP(D17,Feedstuff[],37,FALSE),0)","v":{"v":0,"d":"0.00"}},{"$f":"_xlfn.IFNA(VLOOKUP(D17,Feedstuff[],34,FALSE),0)","v":{"v":0,"d":"0.00"}},{"$f":"_xlfn.IFNA(VLOOKUP(D17,Feedstuff[],38,FALSE),0)","v":{"v":0,"d":"0.00"}},{"$f":"_xlfn.IFNA(VLOOKUP(D17,Feedstuff[],20,FALSE),0)","v":{"v":0,"d":"0.00"}},{"$f":"_xlfn.IFNA(VLOOKUP(D17,Feedstuff[],21,FALSE),0)","v":{"v":0,"d":"0.00"}},{"$f":"_xlfn.IFNA(VLOOKUP(D17,Feedstuff[],25,FALSE),)","v":{"v":0,"d":"0.00"}},null,null,{"$f":"_xlfn.IFNA(IF($L$7=\"< 28 day broiler\",(VLOOKUP(D17,Feedstuff[],28,FALSE)),IF($L$7=\"broiler\",(VLOOKUP(D17,Feedstuff[],29,FALSE)),IF($L$7=\"Hen\",(VLOOKUP(D17,Feedstuff[],30,FALSE)),0))),\"0\")","v":"0"},"",null,null,0,{"$error":"#DIV/0!"},null,{"$f":"_xlfn.IFNA(VLOOKUP(D17,Feedstuff[],15,FALSE),0)","v":{"v":0,"d":"0.00"}},{"$f":"_xlfn.IFNA(VLOOKUP(D16,Feedstuff[],16,FALSE),0)","v":{"v":0,"d":"0.00"}},{"$f":"_xlfn.IFNA(VLOOKUP(D17,Feedstuff[],17,FALSE),0)","v":{"v":0,"d":"0.00"}},{"$f":"_xlfn.IFNA(VLOOKUP(D17,Feedstuff[],18,FALSE),0)","v":{"v":0,"d":"0.00"}},{"$f":"_xlfn.IFNA(VLOOKUP(D17,Feedstuff[],19,FALSE),0)","v":{"v":0,"d":"0.00"}},{"$f":"_xlfn.IFNA(VLOOKUP(D17,Feedstuff[],23,FALSE),0)","v":{"v":0,"d":"0.00"}},{"$f":"_xlfn.IFNA(VLOOKUP(D17,Feedstuff[],24,FALSE),0)","v":{"v":0,"d":"0.00"}},{"$f":"_xlfn.IFNA(VLOOKUP(D17,Feedstuff[],31,FALSE),0)","v":{"v":0,"d":"0.00"}},{"$f":"_xlfn.IFNA(VLOOKUP(D17,Feedstuff[],32,FALSE),0)","v":{"v":0,"d":"0.00"}}]
[null,null,5,null,{"v":0,"d":"0.00"},{"v":0,"d":"0.00"},{"$f":"_xlfn.IFNA(VLOOKUP(D18,Feedstuff[],26,FALSE),0)","v":{"v":0,"d":"0.00"}},{"$f":"_xlfn.IFNA(VLOOKUP(D18,Feedstuff[],5,FALSE),0)","v":{"v":0,"d":"0.00"}},{"$f":"_xlfn.IFNA(VLOOKUP(D18,Feedstuff[],7,FALSE),0)","v":{"v":0,"d":"0.00"}},{"$f":"_xlfn.IFNA(VLOOKUP(D18,Feedstuff[],6,FALSE),0)","v":{"v":0,"d":"0.00"}},{"$f":"_xlfn.IFNA(VLOOKUP(D18,Feedstuff[],9,FALSE),0)","v":{"v":0,"d":"0.00"}},{"$f":"_xlfn.IFNA(VLOOKUP(D18,Feedstuff[],11,FALSE),0)","v":{"v":0,"d":"0.00"}},{"$f":"_xlfn.IFNA(VLOOKUP(D18,Feedstuff[],13,FALSE),0)","v":{"v":0,"d":"0.00"}},{"$f":"_xlfn.IFNA(VLOOKUP(D18,Feedstuff[],10,FALSE),0)","v":{"v":0,"d":"0.00"}},{"$f":"_xlfn.IFNA(VLOOKUP(D18,Feedstuff[],14,FALSE),0)","v":{"v":0,"d":"0.00"}},{"$f":"_xlfn.IFNA(VLOOKUP(D18,Feedstuff[],33,FALSE),0)","v":{"v":0,"d":"0.00"}},{"$f":"_xlfn.IFNA(VLOOKUP(D18,Feedstuff[],35,FALSE),0)","v":{"v":0,"d":"0.00"}},{"$f":"_xlfn.IFNA(VLOOKUP(D18,Feedstuff[],37,FALSE),0)","v":{"v":0,"d":"0.00"}},{"$f":"_xlfn.IFNA(VLOOKUP(D18,Feedstuff[],34,FALSE),0)","v":{"v":0,"d":"0.00"}},{"$f":"_xlfn.IFNA(VLOOKUP(D18,Feedstuff[],38,FALSE),0)","v":{"v":0,"d":"0.00"}},{"$f":"_xlfn.IFNA(VLOOKUP(D18,Feedstuff[],20,FALSE),0)","v":{"v":0,"d":"0.00"}},{"$f":"_xlfn.IFNA(VLOOKUP(D18,Feedstuff[],21,FALSE),0)","v":{"v":0,"d":"0.00"}},{"$f":"_xlfn.IFNA(VLOOKUP(D18,Feedstuff[],25,FALSE),)","v":{"v":0,"d":"0.00"}},null,null,{"$f":"_xlfn.IFNA(IF($L$7=\"< 28 day broiler\",(VLOOKUP(D18,Feedstuff[],28,FALSE)),IF($L$7=\"broiler\",(VLOOKUP(D18,Feedstuff[],29,FALSE)),IF($L$7=\"Hen\",(VLOOKUP(D18,Feedstuff[],30,FALSE)),0))),\"0\")","v":"0"},"",null,null,0,{"$error":"#DIV/0!"},null,{"$f":"_xlfn.IFNA(VLOOKUP(D18,Feedstuff[],15,FALSE),0)","v":{"v":0,"d":"0.00"}},{"$f":"_xlfn.IFNA(VLOOKUP(D17,Feedstuff[],16,FALSE),0)","v":{"v":0,"d":"0.00"}},{"$f":"_xlfn.IFNA(VLOOKUP(D18,Feedstuff[],17,FALSE),0)","v":{"v":0,"d":"0.00"}},{"$f":"_xlfn.IFNA(VLOOKUP(D18,Feedstuff[],18,FALSE),0)","v":{"v":0,"d":"0.00"}},{"$f":"_xlfn.IFNA(VLOOKUP(D18,Feedstuff[],19,FALSE),0)","v":{"v":0,"d":"0.00"}},{"$f":"_xlfn.IFNA(VLOOKUP(D18,Feedstuff[],23,FALSE),0)","v":{"v":0,"d":"0.00"}},{"$f":"_xlfn.IFNA(VLOOKUP(D18,Feedstuff[],24,FALSE),0)","v":{"v":0,"d":"0.00"}},{"$f":"_xlfn.IFNA(VLOOKUP(D18,Feedstuff[],31,FALSE),0)","v":{"v":0,"d":"0.00"}},{"$f":"_xlfn.IFNA(VLOOKUP(D18,Feedstuff[],32,FALSE),0)","v":{"v":0,"d":"0.00"}}]
[null,null,6,null,{"v":0,"d":"0.00"},{"v":0,"d":"0.00"},{"$f":"_xlfn.IFNA(VLOOKUP(D19,Feedstuff[],26,FALSE),0)","v":{"v":0,"d":"0.00"}},{"$f":"_xlfn.IFNA(VLOOKUP(D19,Feedstuff[],5,FALSE),0)","v":{"v":0,"d":"0.00"}},{"$f":"_xlfn.IFNA(VLOOKUP(D19,Feedstuff[],7,FALSE),0)","v":{"v":0,"d":"0.00"}},{"$f":"_xlfn.IFNA(VLOOKUP(D19,Feedstuff[],6,FALSE),0)","v":{"v":0,"d":"0.00"}},{"$f":"_xlfn.IFNA(VLOOKUP(D19,Feedstuff[],9,FALSE),0)","v":{"v":0,"d":"0.00"}},{"$f":"_xlfn.IFNA(VLOOKUP(D19,Feedstuff[],11,FALSE),0)","v":{"v":0,"d":"0.00"}},{"$f":"_xlfn.IFNA(VLOOKUP(D19,Feedstuff[],13,FALSE),0)","v":{"v":0,"d":"0.00"}},{"$f":"_xlfn.IFNA(VLOOKUP(D19,Feedstuff[],10,FALSE),0)","v":{"v":0,"d":"0.00"}},{"$f":"_xlfn.IFNA(VLOOKUP(D19,Feedstuff[],14,FALSE),0)","v":{"v":0,"d":"0.00"}},{"$f":"_xlfn.IFNA(VLOOKUP(D19,Feedstuff[],33,FALSE),0)","v":{"v":0,"d":"0.00"}},{"$f":"_xlfn.IFNA(VLOOKUP(D19,Feedstuff[],35,FALSE),0)","v":{"v":0,"d":"0.00"}},{"$f":"_xlfn.IFNA(VLOOKUP(D19,Feedstuff[],37,FALSE),0)","v":{"v":0,"d":"0.00"}},{"$f":"_xlfn.IFNA(VLOOKUP(D19,Feedstuff[],34,FALSE),0)","v":{"v":0,"d":"0.00"}},{"$f":"_xlfn.IFNA(VLOOKUP(D19,Feedstuff[],38,FALSE),0)","v":{"v":0,"d":"0.00"}},{"$f":"_xlfn.IFNA(VLOOKUP(D19,Feedstuff[],20,FALSE),0)","v":{"v":0,"d":"0.00"}},{"$f":"_xlfn.IFNA(VLOOKUP(D19,Feedstuff[],21,FALSE),0)","v":{"v":0,"d":"0.00"}},{"$f":"_xlfn.IFNA(VLOOKUP(D19,Feedstuff[],25,FALSE),)","v":{"v":0,"d":"0.00"}},null,null,{"$f":"_xlfn.IFNA(IF($L$7=\"< 28 day broiler\",(VLOOKUP(D19,Feedstuff[],28,FALSE)),IF($L$7=\"broiler\",(VLOOKUP(D19,Feedstuff[],29,FALSE)),IF($L$7=\"Hen\",(VLOOKUP(D19,Feedstuff[],30,FALSE)),0))),\"0\")","v":"0"},"",null,null,0,{"$error":"#DIV/0!"},null,{"$f":"_xlfn.IFNA(VLOOKUP(D19,Feedstuff[],15,FALSE),0)","v":{"v":0,"d":"0.00"}},{"$f":"_xlfn.IFNA(VLOOKUP(D18,Feedstuff[],16,FALSE),0)","v":{"v":0,"d":"0.00"}},{"$f":"_xlfn.IFNA(VLOOKUP(D19,Feedstuff[],17,FALSE),0)","v":{"v":0,"d":"0.00"}},{"$f":"_xlfn.IFNA(VLOOKUP(D19,Feedstuff[],18,FALSE),0)","v":{"v":0,"d":"0.00"}},{"$f":"_xlfn.IFNA(VLOOKUP(D19,Feedstuff[],19,FALSE),0)","v":{"v":0,"d":"0.00"}},{"$f":"_xlfn.IFNA(VLOOKUP(D19,Feedstuff[],23,FALSE),0)","v":{"v":0,"d":"0.00"}},{"$f":"_xlfn.IFNA(VLOOKUP(D19,Feedstuff[],24,FALSE),0)","v":{"v":0,"d":"0.00"}},{"$f":"_xlfn.IFNA(VLOOKUP(D19,Feedstuff[],31,FALSE),0)","v":{"v":0,"d":"0.00"}},{"$f":"_xlfn.IFNA(VLOOKUP(D19,Feedstuff[],32,FALSE),0)","v":{"v":0,"d":"0.00"}}]
[null,null,7,null,{"v":0,"d":"0.00"},{"v":0,"d":"0.00"},{"$f":"_xlfn.IFNA(VLOOKUP(D20,Feedstuff[],26,FALSE),0)","v":{"v":0,"d":"0.00"}},{"$f":"_xlfn.IFNA(VLOOKUP(D20,Feedstuff[],5,FALSE),0)","v":{"v":0,"d":"0.00"}},{"$f":"_xlfn.IFNA(VLOOKUP(D20,Feedstuff[],7,FALSE),0)","v":{"v":0,"d":"0.00"}},{"$f":"_xlfn.IFNA(VLOOKUP(D20,Feedstuff[],6,FALSE),0)","v":{"v":0,"d":"0.00"}},{"$f":"_xlfn.IFNA(VLOOKUP(D20,Feedstuff[],9,FALSE),0)","v":{"v":0,"d":"0.00"}},{"$f":"_xlfn.IFNA(VLOOKUP(D20,Feedstuff[],11,FALSE),0)","v":{"v":0,"d":"0.00"}},{"$f":"_xlfn.IFNA(VLOOKUP(D20,Feedstuff[],13,FALSE),0)","v":{"v":0,"d":"0.00"}},{"$f":"_xlfn.IFNA(VLOOKUP(D20,Feedstuff[],10,FALSE),0)","v":{"v":0,"d":"0.00"}},{"$f":"_xlfn.IFNA(VLOOKUP(D20,Feedstuff[],14,FALSE),0)","v":{"v":0,"d":"0.00"}},{"$f":"_xlfn.IFNA(VLOOKUP(D20,Feedstuff[],33,FALSE),0)","v":{"v":0,"d":"0.00"}},{"$f":"_xlfn.IFNA(VLOOKUP(D20,Feedstuff[],35,FALSE),0)","v":{"v":0,"d":"0.00"}},{"$f":"_xlfn.IFNA(VLOOKUP(D20,Feedstuff[],37,FALSE),0)","v":{"v":0,"d":"0.00"}},{"$f":"_xlfn.IFNA(VLOOKUP(D20,Feedstuff[],34,FALSE),0)","v":{"v":0,"d":"0.00"}},{"$f":"_xlfn.IFNA(VLOOKUP(D20,Feedstuff[],38,FALSE),0)","v":{"v":0,"d":"0.00"}},{"$f":"_xlfn.IFNA(VLOOKUP(D20,Feedstuff[],20,FALSE),0)","v":{"v":0,"d":"0.00"}},{"$f":"_xlfn.IFNA(VLOOKUP(D20,Feedstuff[],21,FALSE),0)","v":{"v":0,"d":"0.00"}},{"$f":"_xlfn.IFNA(VLOOKUP(D20,Feedstuff[],25,FALSE),)","v":{"v":0,"d":"0.00"}},null,null,{"$f":"_xlfn.IFNA(IF($L$7=\"< 28 day broiler\",(VLOOKUP(D20,Feedstuff[],28,FALSE)),IF($L$7=\"broiler\",(VLOOKUP(D20,Feedstuff[],29,FALSE)),IF($L$7=\"Hen\",(VLOOKUP(D20,Feedstuff[],30,FALSE)),0))),\"0\")","v":"0"},"",null,null,0,{"$error":"#DIV/0!"},null,{"$f":"_xlfn.IFNA(VLOOKUP(D20,Feedstuff[],15,FALSE),0)","v":{"v":0,"d":"0.00"}},{"$f":"_xlfn.IFNA(VLOOKUP(D19,Feedstuff[],16,FALSE),0)","v":{"v":0,"d":"0.00"}},{"$f":"_xlfn.IFNA(VLOOKUP(D20,Feedstuff[],17,FALSE),0)","v":{"v":0,"d":"0.00"}},{"$f":"_xlfn.IFNA(VLOOKUP(D20,Feedstuff[],18,FALSE),0)","v":{"v":0,"d":"0.00"}},{"$f":"_xlfn.IFNA(VLOOKUP(D20,Feedstuff[],19,FALSE),0)","v":{"v":0,"d":"0.00"}},{"$f":"_xlfn.IFNA(VLOOKUP(D20,Feedstuff[],23,FALSE),0)","v":{"v":0,"d":"0.00"}},{"$f":"_xlfn.IFNA(VLOOKUP(D20,Feedstuff[],24,FALSE),0)","v":{"v":0,"d":"0.00"}},{"$f":"_xlfn.IFNA(VLOOKUP(D20,Feedstuff[],31,FALSE),0)","v":{"v":0,"d":"0.00"}},{"$f":"_xlfn.IFNA(VLOOKUP(D20,Feedstuff[],32,FALSE),0)","v":{"v":0,"d":"0.00"}}]
[null,null,8,null,{"v":0,"d":"0.00"},{"v":0,"d":"0.00"},{"$f":"_xlfn.IFNA(VLOOKUP(D21,Feedstuff[],26,FALSE),0)","v":{"v":0,"d":"0.00"}},{"$f":"_xlfn.IFNA(VLOOKUP(D21,Feedstuff[],5,FALSE),0)","v":{"v":0,"d":"0.00"}},{"$f":"_xlfn.IFNA(VLOOKUP(D21,Feedstuff[],7,FALSE),0)","v":{"v":0,"d":"0.00"}},{"$f":"_xlfn.IFNA(VLOOKUP(D21,Feedstuff[],6,FALSE),0)","v":{"v":0,"d":"0.00"}},{"$f":"_xlfn.IFNA(VLOOKUP(D21,Feedstuff[],9,FALSE),0)","v":{"v":0,"d":"0.00"}},{"$f":"_xlfn.IFNA(VLOOKUP(D21,Feedstuff[],11,FALSE),0)","v":{"v":0,"d":"0.00"}},{"$f":"_xlfn.IFNA(VLOOKUP(D21,Feedstuff[],13,FALSE),0)","v":{"v":0,"d":"0.00"}},{"$f":"_xlfn.IFNA(VLOOKUP(D21,Feedstuff[],10,FALSE),0)","v":{"v":0,"d":"0.00"}},{"$f":"_xlfn.IFNA(VLOOKUP(D21,Feedstuff[],14,FALSE),0)","v":{"v":0,"d":"0.00"}},{"$f":"_xlfn.IFNA(VLOOKUP(D21,Feedstuff[],33,FALSE),0)","v":{"v":0,"d":"0.00"}},{"$f":"_xlfn.IFNA(VLOOKUP(D21,Feedstuff[],35,FALSE),0)","v":{"v":0,"d":"0.00"}},{"$f":"_xlfn.IFNA(VLOOKUP(D21,Feedstuff[],37,FALSE),0)","v":{"v":0,"d":"0.00"}},{"$f":"_xlfn.IFNA(VLOOKUP(D21,Feedstuff[],34,FALSE),0)","v":{"v":0,"d":"0.00"}},{"$f":"_xlfn.IFNA(VLOOKUP(D21,Feedstuff[],38,FALSE),0)","v":{"v":0,"d":"0.00"}},{"$f":"_xlfn.IFNA(VLOOKUP(D21,Feedstuff[],20,FALSE),0)","v":{"v":0,"d":"0.00"}},{"$f":"_xlfn.IFNA(VLOOKUP(D21,Feedstuff[],21,FALSE),0)","v":{"v":0,"d":"0.00"}},{"$f":"_xlfn.IFNA(VLOOKUP(D21,Feedstuff[],25,FALSE),)","v":{"v":0,"d":"0.00"}},null,null,{"$f":"_xlfn.IFNA(IF($L$7=\"< 28 day broiler\",(VLOOKUP(D21,Feedstuff[],28,FALSE)),IF($L$7=\"broiler\",(VLOOKUP(D21,Feedstuff[],29,FALSE)),IF($L$7=\"Hen\",(VLOOKUP(D21,Feedstuff[],30,FALSE)),0))),\"0\")","v":"0"},"",null,null,0,{"$error":"#DIV/0!"},null,{"$f":"_xlfn.IFNA(VLOOKUP(D21,Feedstuff[],15,FALSE),0)","v":{"v":0,"d":"0.00"}},{"$f":"_xlfn.IFNA(VLOOKUP(D20,Feedstuff[],16,FALSE),0)","v":{"v":0,"d":"0.00"}},{"$f":"_xlfn.IFNA(VLOOKUP(D21,Feedstuff[],17,FALSE),0)","v":{"v":0,"d":"0.00"}},{"$f":"_xlfn.IFNA(VLOOKUP(D21,Feedstuff[],18,FALSE),0)","v":{"v":0,"d":"0.00"}},{"$f":"_xlfn.IFNA(VLOOKUP(D21,Feedstuff[],19,FALSE),0)","v":{"v":0,"d":"0.00"}},{"$f":"_xlfn.IFNA(VLOOKUP(D21,Feedstuff[],23,FALSE),0)","v":{"v":0,"d":"0.00"}},{"$f":"_xlfn.IFNA(VLOOKUP(D21,Feedstuff[],24,FALSE),0)","v":{"v":0,"d":"0.00"}},{"$f":"_xlfn.IFNA(VLOOKUP(D21,Feedstuff[],31,FALSE),0)","v":{"v":0,"d":"0.00"}},{"$f":"_xlfn.IFNA(VLOOKUP(D21,Feedstuff[],32,FALSE),0)","v":{"v":0,"d":"0.00"}}]
[null,null,9,null,{"v":0,"d":"0.00"},{"v":0,"d":"0.00"},{"$f":"_xlfn.IFNA(VLOOKUP(D22,Feedstuff[],26,FALSE),0)","v":{"v":0,"d":"0.00"}},{"$f":"_xlfn.IFNA(VLOOKUP(D22,Feedstuff[],5,FALSE),0)","v":{"v":0,"d":"0.00"}},{"$f":"_xlfn.IFNA(VLOOKUP(D22,Feedstuff[],7,FALSE),0)","v":{"v":0,"d":"0.00"}},{"$f":"_xlfn.IFNA(VLOOKUP(D22,Feedstuff[],6,FALSE),0)","v":{"v":0,"d":"0.00"}},{"$f":"_xlfn.IFNA(VLOOKUP(D22,Feedstuff[],9,FALSE),0)","v":{"v":0,"d":"0.00"}},{"$f":"_xlfn.IFNA(VLOOKUP(D22,Feedstuff[],11,FALSE),0)","v":{"v":0,"d":"0.00"}},{"$f":"_xlfn.IFNA(VLOOKUP(D22,Feedstuff[],13,FALSE),0)","v":{"v":0,"d":"0.00"}},{"$f":"_xlfn.IFNA(VLOOKUP(D22,Feedstuff[],10,FALSE),0)","v":{"v":0,"d":"0.00"}},{"$f":"_xlfn.IFNA(VLOOKUP(D22,Feedstuff[],14,FALSE),0)","v":{"v":0,"d":"0.00"}},{"$f":"_xlfn.IFNA(VLOOKUP(D22,Feedstuff[],33,FALSE),0)","v":{"v":0,"d":"0.00"}},{"$f":"_xlfn.IFNA(VLOOKUP(D22,Feedstuff[],35,FALSE),0)","v":{"v":0,"d":"0.00"}},{"$f":"_xlfn.IFNA(VLOOKUP(D22,Feedstuff[],37,FALSE),0)","v":{"v":0,"d":"0.00"}},{"$f":"_xlfn.IFNA(VLOOKUP(D22,Feedstuff[],34,FALSE),0)","v":{"v":0,"d":"0.00"}},{"$f":"_xlfn.IFNA(VLOOKUP(D22,Feedstuff[],38,FALSE),0)","v":{"v":0,"d":"0.00"}},{"$f":"_xlfn.IFNA(VLOOKUP(D22,Feedstuff[],20,FALSE),0)","v":{"v":0,"d":"0.00"}},{"$f":"_xlfn.IFNA(VLOOKUP(D22,Feedstuff[],21,FALSE),0)","v":{"v":0,"d":"0.00"}},{"$f":"_xlfn.IFNA(VLOOKUP(D22,Feedstuff[],25,FALSE),)","v":{"v":0,"d":"0.00"}},null,null,{"$f":"_xlfn.IFNA(IF($L$7=\"< 28 day broiler\",(VLOOKUP(D22,Feedstuff[],28,FALSE)),IF($L$7=\"broiler\",(VLOOKUP(D22,Feedstuff[],29,FALSE)),IF($L$7=\"Hen\",(VLOOKUP(D22,Feedstuff[],30,FALSE)),0))),\"0\")","v":"0"},"",null,null,0,{"$error":"#DIV/0!"},null,{"$f":"_xlfn.IFNA(VLOOKUP(D22,Feedstuff[],15,FALSE),0)","v":{"v":0,"d":"0.00"}},{"$f":"_xlfn.IFNA(VLOOKUP(D21,Feedstuff[],16,FALSE),0)","v":{"v":0,"d":"0.00"}},{"$f":"_xlfn.IFNA(VLOOKUP(D22,Feedstuff[],17,FALSE),0)","v":{"v":0,"d":"0.00"}},{"$f":"_xlfn.IFNA(VLOOKUP(D22,Feedstuff[],18,FALSE),0)","v":{"v":0,"d":"0.00"}},{"$f":"_xlfn.IFNA(VLOOKUP(D22,Feedstuff[],19,FALSE),0)","v":{"v":0,"d":"0.00"}},{"$f":"_xlfn.IFNA(VLOOKUP(D22,Feedstuff[],23,FALSE),0)","v":{"v":0,"d":"0.00"}},{"$f":"_xlfn.IFNA(VLOOKUP(D22,Feedstuff[],24,FALSE),0)","v":{"v":0,"d":"0.00"}},{"$f":"_xlfn.IFNA(VLOOKUP(D22,Feedstuff[],31,FALSE),0)","v":{"v":0,"d":"0.00"}},{"$f":"_xlfn.IFNA(VLOOKUP(D22,Feedstuff[],32,FALSE),0)","v":{"v":0,"d":"0.00"}}]
[null,null,10,null,{"v":0,"d":"0.00"},{"v":0,"d":"0.00"},{"$f":"_xlfn.IFNA(VLOOKUP(D23,Feedstuff[],26,FALSE),0)","v":{"v":0,"d":"0.00"}},{"$f":"_xlfn.IFNA(VLOOKUP(D23,Feedstuff[],5,FALSE),0)","v":{"v":0,"d":"0.00"}},{"$f":"_xlfn.IFNA(VLOOKUP(D23,Feedstuff[],7,FALSE),0)","v":{"v":0,"d":"0.00"}},{"$f":"_xlfn.IFNA(VLOOKUP(D23,Feedstuff[],6,FALSE),0)","v":{"v":0,"d":"0.00"}},{"$f":"_xlfn.IFNA(VLOOKUP(D23,Feedstuff[],9,FALSE),0)","v":{"v":0,"d":"0.00"}},{"$f":"_xlfn.IFNA(VLOOKUP(D23,Feedstuff[],11,FALSE),0)","v":{"v":0,"d":"0.00"}},{"$f":"_xlfn.IFNA(VLOOKUP(D23,Feedstuff[],13,FALSE),0)","v":{"v":0,"d":"0.00"}},{"$f":"_xlfn.IFNA(VLOOKUP(D23,Feedstuff[],10,FALSE),0)","v":{"v":0,"d":"0.00"}},{"$f":"_xlfn.IFNA(VLOOKUP(D23,Feedstuff[],14,FALSE),0)","v":{"v":0,"d":"0.00"}},{"$f":"_xlfn.IFNA(VLOOKUP(D23,Feedstuff[],33,FALSE),0)","v":{"v":0,"d":"0.00"}},{"$f":"_xlfn.IFNA(VLOOKUP(D23,Feedstuff[],35,FALSE),0)","v":{"v":0,"d":"0.00"}},{"$f":"_xlfn.IFNA(VLOOKUP(D23,Feedstuff[],37,FALSE),0)","v":{"v":0,"d":"0.00"}},{"$f":"_xlfn.IFNA(VLOOKUP(D23,Feedstuff[],34,FALSE),0)","v":{"v":0,"d":"0.00"}},{"$f":"_xlfn.IFNA(VLOOKUP(D23,Feedstuff[],38,FALSE),0)","v":{"v":0,"d":"0.00"}},{"$f":"_xlfn.IFNA(VLOOKUP(D23,Feedstuff[],20,FALSE),0)","v":{"v":0,"d":"0.00"}},{"$f":"_xlfn.IFNA(VLOOKUP(D23,Feedstuff[],21,FALSE),0)","v":{"v":0,"d":"0.00"}},{"$f":"_xlfn.IFNA(VLOOKUP(D23,Feedstuff[],25,FALSE),)","v":{"v":0,"d":"0.00"}},null,null,{"$f":"_xlfn.IFNA(IF($L$7=\"< 28 day broiler\",(VLOOKUP(D23,Feedstuff[],28,FALSE)),IF($L$7=\"broiler\",(VLOOKUP(D23,Feedstuff[],29,FALSE)),IF($L$7=\"Hen\",(VLOOKUP(D23,Feedstuff[],30,FALSE)),0))),\"0\")","v":"0"},"",null,null,0,{"$error":"#DIV/0!"},null,{"$f":"_xlfn.IFNA(VLOOKUP(D23,Feedstuff[],15,FALSE),0)","v":{"v":0,"d":"0.00"}},{"$f":"_xlfn.IFNA(VLOOKUP(D22,Feedstuff[],16,FALSE),0)","v":{"v":0,"d":"0.00"}},{"$f":"_xlfn.IFNA(VLOOKUP(D23,Feedstuff[],17,FALSE),0)","v":{"v":0,"d":"0.00"}},{"$f":"_xlfn.IFNA(VLOOKUP(D23,Feedstuff[],18,FALSE),0)","v":{"v":0,"d":"0.00"}},{"$f":"_xlfn.IFNA(VLOOKUP(D23,Feedstuff[],19,FALSE),0)","v":{"v":0,"d":"0.00"}},{"$f":"_xlfn.IFNA(VLOOKUP(D23,Feedstuff[],23,FALSE),0)","v":{"v":0,"d":"0.00"}},{"$f":"_xlfn.IFNA(VLOOKUP(D23,Feedstuff[],24,FALSE),0)","v":{"v":0,"d":"0.00"}},{"$f":"_xlfn.IFNA(VLOOKUP(D23,Feedstuff[],31,FALSE),0)","v":{"v":0,"d":"0.00"}},{"$f":"_xlfn.IFNA(VLOOKUP(D23,Feedstuff[],32,FALSE),0)","v":{"v":0,"d":"0.00"}}]
[null,null,11,null,{"v":0,"d":"0.00"},{"v":0,"d":"0.00"},{"$f":"_xlfn.IFNA(VLOOKUP(D24,Feedstuff[],26,FALSE),0)","v":{"v":0,"d":"0.00"}},{"$f":"_xlfn.IFNA(VLOOKUP(D24,Feedstuff[],5,FALSE),0)","v":{"v":0,"d":"0.00"}},{"$f":"_xlfn.IFNA(VLOOKUP(D24,Feedstuff[],7,FALSE),0)","v":{"v":0,"d":"0.00"}},{"$f":"_xlfn.IFNA(VLOOKUP(D24,Feedstuff[],6,FALSE),0)","v":{"v":0,"d":"0.00"}},{"$f":"_xlfn.IFNA(VLOOKUP(D24,Feedstuff[],9,FALSE),0)","v":{"v":0,"d":"0.00"}},{"$f":"_xlfn.IFNA(VLOOKUP(D24,Feedstuff[],11,FALSE),0)","v":{"v":0,"d":"0.00"}},{"$f":"_xlfn.IFNA(VLOOKUP(D24,Feedstuff[],13,FALSE),0)","v":{"v":0,"d":"0.00"}},{"$f":"_xlfn.IFNA(VLOOKUP(D24,Feedstuff[],10,FALSE),0)","v":{"v":0,"d":"0.00"}},{"$f":"_xlfn.IFNA(VLOOKUP(D24,Feedstuff[],14,FALSE),0)","v":{"v":0,"d":"0.00"}},{"$f":"_xlfn.IFNA(VLOOKUP(D24,Feedstuff[],33,FALSE),0)","v":{"v":0,"d":"0.00"}},{"$f":"_xlfn.IFNA(VLOOKUP(D24,Feedstuff[],35,FALSE),0)","v":{"v":0,"d":"0.00"}},{"$f":"_xlfn.IFNA(VLOOKUP(D24,Feedstuff[],37,FALSE),0)","v":{"v":0,"d":"0.00"}},{"$f":"_xlfn.IFNA(VLOOKUP(D24,Feedstuff[],34,FALSE),0)","v":{"v":0,"d":"0.00"}},{"$f":"_xlfn.IFNA(VLOOKUP(D24,Feedstuff[],38,FALSE),0)","v":{"v":0,"d":"0.00"}},{"$f":"_xlfn.IFNA(VLOOKUP(D24,Feedstuff[],20,FALSE),0)","v":{"v":0,"d":"0.00"}},{"$f":"_xlfn.IFNA(VLOOKUP(D24,Feedstuff[],21,FALSE),0)","v":{"v":0,"d":"0.00"}},{"$f":"_xlfn.IFNA(VLOOKUP(D24,Feedstuff[],25,FALSE),)","v":{"v":0,"d":"0.00"}},null,null,{"$f":"_xlfn.IFNA(IF($L$7=\"< 28 day broiler\",(VLOOKUP(D24,Feedstuff[],28,FALSE)),IF($L$7=\"broiler\",(VLOOKUP(D24,Feedstuff[],29,FALSE)),IF($L$7=\"Hen\",(VLOOKUP(D24,Feedstuff[],30,FALSE)),0))),\"0\")","v":"0"},"",null,null,0,{"$error":"#DIV/0!"},null,{"$f":"_xlfn.IFNA(VLOOKUP(D24,Feedstuff[],15,FALSE),0)","v":{"v":0,"d":"0.00"}},{"$f":"_xlfn.IFNA(VLOOKUP(D23,Feedstuff[],16,FALSE),0)","v":{"v":0,"d":"0.00"}},{"$f":"_xlfn.IFNA(VLOOKUP(D24,Feedstuff[],17,FALSE),0)","v":{"v":0,"d":"0.00"}},{"$f":"_xlfn.IFNA(VLOOKUP(D24,Feedstuff[],18,FALSE),0)","v":{"v":0,"d":"0.00"}},{"$f":"_xlfn.IFNA(VLOOKUP(D24,Feedstuff[],19,FALSE),0)","v":{"v":0,"d":"0.00"}},{"$f":"_xlfn.IFNA(VLOOKUP(D24,Feedstuff[],23,FALSE),0)","v":{"v":0,"d":"0.00"}},{"$f":"_xlfn.IFNA(VLOOKUP(D24,Feedstuff[],24,FALSE),0)","v":{"v":0,"d":"0.00"}},{"$f":"_xlfn.IFNA(VLOOKUP(D24,Feedstuff[],31,FALSE),0)","v":{"v":0,"d":"0.00"}},{"$f":"_xlfn.IFNA(VLOOKUP(D24,Feedstuff[],32,FALSE),0)","v":{"v":0,"d":"0.00"}}]
[null,null,12,null,{"v":0,"d":"0.00"},{"v":0,"d":"0.00"},{"$f":"_xlfn.IFNA(VLOOKUP(D25,Feedstuff[],26,FALSE),0)","v":{"v":0,"d":"0.00"}},{"$f":"_xlfn.IFNA(VLOOKUP(D25,Feedstuff[],5,FALSE),0)","v":{"v":0,"d":"0.00"}},{"$f":"_xlfn.IFNA(VLOOKUP(D25,Feedstuff[],7,FALSE),0)","v":{"v":0,"d":"0.00"}},{"$f":"_xlfn.IFNA(VLOOKUP(D25,Feedstuff[],6,FALSE),0)","v":{"v":0,"d":"0.00"}},{"$f":"_xlfn.IFNA(VLOOKUP(D25,Feedstuff[],9,FALSE),0)","v":{"v":0,"d":"0.00"}},{"$f":"_xlfn.IFNA(VLOOKUP(D25,Feedstuff[],11,FALSE),0)","v":{"v":0,"d":"0.00"}},{"$f":"_xlfn.IFNA(VLOOKUP(D25,Feedstuff[],13,FALSE),0)","v":{"v":0,"d":"0.00"}},{"$f":"_xlfn.IFNA(VLOOKUP(D25,Feedstuff[],10,FALSE),0)","v":{"v":0,"d":"0.00"}},{"$f":"_xlfn.IFNA(VLOOKUP(D25,Feedstuff[],14,FALSE),0)","v":{"v":0,"d":"0.00"}},{"$f":"_xlfn.IFNA(VLOOKUP(D25,Feedstuff[],33,FALSE),0)","v":{"v":0,"d":"0.00"}},{"$f":"_xlfn.IFNA(VLOOKUP(D25,Feedstuff[],35,FALSE),0)","v":{"v":0,"d":"0.00"}},{"$f":"_xlfn.IFNA(VLOOKUP(D25,Feedstuff[],37,FALSE),0)","v":{"v":0,"d":"0.00"}},{"$f":"_xlfn.IFNA(VLOOKUP(D25,Feedstuff[],34,FALSE),0)","v":{"v":0,"d":"0.00"}},{"$f":"_xlfn.IFNA(VLOOKUP(D25,Feedstuff[],38,FALSE),0)","v":{"v":0,"d":"0.00"}},{"$f":"_xlfn.IFNA(VLOOKUP(D25,Feedstuff[],20,FALSE),0)","v":{"v":0,"d":"0.00"}},{"$f":"_xlfn.IFNA(VLOOKUP(D25,Feedstuff[],21,FALSE),0)","v":{"v":0,"d":"0.00"}},{"$f":"_xlfn.IFNA(VLOOKUP(D25,Feedstuff[],25,FALSE),)","v":{"v":0,"d":"0.00"}},null,null,{"$f":"_xlfn.IFNA(IF($L$7=\"< 28 day broiler\",(VLOOKUP(D25,Feedstuff[],28,FALSE)),IF($L$7=\"broiler\",(VLOOKUP(D25,Feedstuff[],29,FALSE)),IF($L$7=\"Hen\",(VLOOKUP(D25,Feedstuff[],30,FALSE)),0))),\"0\")","v":"0"},"",null,null,0,{"$error":"#DIV/0!"},null,{"$f":"_xlfn.IFNA(VLOOKUP(D25,Feedstuff[],15,FALSE),0)","v":{"v":0,"d":"0.00"}},{"$f":"_xlfn.IFNA(VLOOKUP(D24,Feedstuff[],16,FALSE),0)","v":{"v":0,"d":"0.00"}},{"$f":"_xlfn.IFNA(VLOOKUP(D25,Feedstuff[],17,FALSE),0)","v":{"v":0,"d":"0.00"}},{"$f":"_xlfn.IFNA(VLOOKUP(D25,Feedstuff[],18,FALSE),0)","v":{"v":0,"d":"0.00"}},{"$f":"_xlfn.IFNA(VLOOKUP(D25,Feedstuff[],19,FALSE),0)","v":{"v":0,"d":"0.00"}},{"$f":"_xlfn.IFNA(VLOOKUP(D25,Feedstuff[],23,FALSE),0)","v":{"v":0,"d":"0.00"}},{"$f":"_xlfn.IFNA(VLOOKUP(D25,Feedstuff[],24,FALSE),0)","v":{"v":0,"d":"0.00"}},{"$f":"_xlfn.IFNA(VLOOKUP(D25,Feedstuff[],31,FALSE),0)","v":{"v":0,"d":"0.00"}},{"$f":"_xlfn.IFNA(VLOOKUP(D25,Feedstuff[],32,FALSE),0)","v":{"v":0,"d":"0.00"}}]
[]
[{"$nulls":3},"TOTAL",{"$f":"SUM(E14:E25)","v":{"v":0,"d":"0.00"}},{"$f":"SUM(F14:F25)","v":{"v":0,"d":"0.00"}},{"$f":"SUMPRODUCT($F$14:$F$25,G14:G25)/100","v":{"v":0,"d":"0.00"}},{"$f":"SUMPRODUCT($F$14:$F$25,H14:H25)/100","v":{"v":0,"d":"0.00"}},{"$f":"SUMPRODUCT($F$14:$F$25,I14:I25)/100","v":{"v":0,"d":"0.00"}},{"$f":"SUMPRODUCT($F$14:$F$25,J14:J25)/100","v":{"v":0,"d":"0.00"}},{"v":0,"d":"0.00"},{"v":0,"d":"0.00"},{"v":0,"d":"0.00"},{"v":0,"d":"0.00"},{"v":0,"d":"0.00"},{"v":0,"d":"0.00"},{"v":0,"d":"0.00"},{"v":0,"d":"0.00"},{"v":0,"d":"0.00"},{"v":0,"d":"0.00"},{"$f":"SUMPRODUCT($F$14:$F$25,U14:U25)/1000","v":{"v":0,"d":"0.00"}},{"$f":"SUMPRODUCT($F$14:$F$25,V14:V25)/1000","v":{"v":0,"d":"0.00"}},{"$f":"SUMPRODUCT($F$14:$F$25,W14:W25)/1000","v":{"v":0,"d":"0.00"}},{"$nulls":6},{"$f":"SUM(AD14:AD25)","v":0},null,null,{"$f":"IF($E$13=\"%\",(SUMPRODUCT($E$14:$E$25,AG14:AG25)/100),(SUMPRODUCT($F$14:$F$25,AG14:AG25)/100))","v":{"v":0,"d":"0.00"}},{"$f":"IF($E$13=\"%\",(SUMPRODUCT($E$14:$E$25,AH14:AH25)/100),(SUMPRODUCT($F$14:$F$25,AH14:AH25)/100))","v":{"v":0,"d":"0.00"}},{"$f":"IF($E$13=\"%\",(SUMPRODUCT($E$14:$E$25,AI14:AI25)/100),(SUMPRODUCT($F$14:$F$25,AI14:AI25)/100))","v":{"v":0,"d":"0.00"}},{"v":0,"d":"0.00"},{"v":0,"d":"0.00"},{"v":0,"d":"0.00"},{"v":0,"d":"0.00"},{"v":0,"d":"0.00"},{"v":0,"d":"0.00"}]
[{"$nulls":3},"Grinder capacity?",{"$f":"E11-E27","v":{"v":0,"d":"0.00"}},"kg"]
[{"$nulls":6},"ME","CP","FAT","CF","LYS","Met","Met+Cys","Thr","Trp","Dis Lys","Dis Met","Dis Met+Cys","Dis Thr","Dis Try","Ca","P ","Na",{"$nulls":5},"Feed Prices (€/T)",{"$f":"SUMPRODUCT(F14:F25,AC14:AC25)/100","v":0}]
[{"$nulls":5},"Min",{"$f":"_xlfn.IFNA(VLOOKUP($L$12,Requirment[],10,FALSE),\" \")","v":{"v":12.953212459321247,"d":"12.95"}},{"$f":"_xlfn.IFNA(VLOOKUP($L$12,Requirment[],11,FALSE),\" \")","v":{"v":17.11249122807018,"d":"17.11"}},{"$f":"_xlfn.IFNA(VLOOKUP($L$12,Requirment[],12,FALSE),\" \")","v":{"v":4.560016220600162,"d":"4.56"}},{"$f":"_xlfn.IFNA(VLOOKUP($L$12,Requirment[],13,FALSE),\" \")","v":{"v":3.500000000000001,"d":"3.50"}},{"$f":"_xlfn.IFNA(VLOOKUP($L$12,Requirment[],17,FALSE),\" \")","v":{"v":0.629000629000629,"d":"0.63"}},{"$f":"_xlfn.IFNA(VLOOKUP($L$12,Requirment[],19,FALSE),\" \")","v":{"v":0.7777777777777777,"d":"0.78"}},{"$f":"_xlfn.IFNA(VLOOKUP($L$12,Requirment[],21,FALSE),\" \")","v":{"v":0.6228333333333335,"d":"0.62"}},{"$f":"_xlfn.IFNA(VLOOKUP($L$12,Requirment[],23,FALSE),\" \")","v":{"v":0.2666666666666667,"d":"0.27"}},{"$f":"_xlfn.IFNA(VLOOKUP($L$12,Requirment[],25,FALSE),\" \")","v":{"v":0.3333333333333333,"d":"0.33"}},{"$f":"_xlfn.IFNA(VLOOKUP($L$12,Requirment[],18,FALSE),\" \")","v":{"v":0.29600029600029604,"d":"0.30"}},{"$f":"_xlfn.IFNA(VLOOKUP($L$12,Requirment[],20,FALSE),\" \")","v":{"v":0.3429444444444445,"d":"0.34"}},{"$f":"_xlfn.IFNA(VLOOKUP($L$12,Requirment[],22,FALSE),\" \")","v":{"v":0.48627777777777786,"d":"0.49"}},{"$f":"_xlfn.IFNA(VLOOKUP($L$12,Requirment[],20,FALSE),\" \")","v":{"v":0.3429444444444445,"d":"0.34"}},{"$f":"_xlfn.IFNA(VLOOKUP($L$12,Requirment[],26,FALSE),\" \")","v":{"v":0.18333333333333332,"d":"0.18"}},{"$f":"_xlfn.IFNA(VLOOKUP($L$12,Requirment[],14,FALSE),\" \")","v":{"v":0.86333419666753,"d":"0.86"}},{"$f":"_xlfn.IFNA(VLOOKUP($L$12,Requirment[],15,FALSE),\" \")","v":{"v":0.407000407000407,"d":"0.41"}},{"$f":"_xlfn.IFNA(VLOOKUP($L$12,Requirment[],16,FALSE),\" \")","v":{"v":0.7030007030007032,"d":"0.70"}}]
[{"$nulls":5},"Max",{"$f":"_xlfn.IFNA(VLOOKUP($L$12,Requirment[],27,FALSE),\" \")","v":{"v":0,"d":"0.00"}},{"$f":"_xlfn.IFNA(VLOOKUP($L$12,Requirment[],28,FALSE),\" \")","v":{"v":0,"d":"0.00"}},{"$f":"_xlfn.IFNA(VLOOKUP($L$12,Requirment[],29,FALSE),\" \")","v":{"v":0,"d":"0.00"}},{"$f":"_xlfn.IFNA(VLOOKUP($L$12,Requirment[],30,FALSE),\" \")","v":{"v":0,"d":"0.00"}},{"$f":"_xlfn.IFNA(VLOOKUP($L$12,Requirment[],34,FALSE),\" \")","v":{"v":0,"d":"0.00"}},{"$f":"_xlfn.IFNA(VLOOKUP($L$12,Requirment[],36,FALSE),\" \")","v":{"v":0,"d":"0.00"}},{"$f":"_xlfn.IFNA(VLOOKUP($L$12,Requirment[],38,FALSE),\" \")","v":{"v":0,"d":"0.00"}},{"$f":"_xlfn.IFNA(VLOOKUP($L$12,Requirment[],40,FALSE),\" \")","v":{"v":0,"d":"0.00"}},{"$f":"_xlfn.IFNA(VLOOKUP($L$12,Requirment[],42,FALSE),\" \")","v":{"v":0,"d":"0.00"}},{"$f":"_xlfn.IFNA(VLOOKUP($L$12,Requirment[],35,FALSE),\" \")","v":{"v":0,"d":"0.00"}},{"$f":"_xlfn.IFNA(VLOOKUP($L$12,Requirment[],37,FALSE),\" \")","v":{"v":0,"d":"0.00"}},{"$f":"_xlfn.IFNA(VLOOKUP($L$12,Requirment[],39,FALSE),\" \")","v":{"v":0,"d":"0.00"}},{"$f":"_xlfn.IFNA(VLOOKUP($L$12,Requirment[],41,FALSE),\" \")","v":{"v":0,"d":"0.00"}},{"$f":"_xlfn.IFNA(VLOOKUP($L$12,Requirment[],43,FALSE),\" \")","v":{"v":0,"d":"0.00"}},{"$f":"_xlfn.IFNA(VLOOKUP($L$12,Requirment[],31,FALSE),\" \")","v":{"v":0,"d":"0.00"}},{"$f":"_xlfn.IFNA(VLOOKUP($L$12,Requirment[],15,FALSE),\" \")","v":{"v":0.407000407000407,"d":"0.41"}},{"$f":"_xlfn.IFNA(VLOOKUP($L$12,Requirment[],33,FALSE),\" \")","v":{"v":0,"d":"0.00"}}]
[]
[]
[{"$nulls":5},"List selections"]
[{"$nulls":5},"Manual selections"]

{"sheet":"Database_Feedstuffs","index":2,"n_rows":75,"n_cols":39,"rows_kept":75,"merged":[[0,3,0,7],[0,8,0,13],[0,14,0,18],[0,19,0,24],[0,25,0,26],[0,27,0,29],[0,32,0,37]]}
[{"$nulls":3},"Main constituents",{"$nulls":4},"Total Amino Acid",{"$nulls":5},"Fatty Acids",{"$nulls":4},"Minerals ",{"$nulls":5},"Energy",null,"Inclusion levels ",{"$nulls":4},"Digestible Amino acid"]
["Feedstuffs","Matière première","Category","DM %","CP % ","Fiber % ","Fat % ","Ash % ","LYS % ","THR % ","MET % ","CYS % ","MET+CYS % ","TRY % ","C16:0 g/Kg Fat","C18:0 g/Kg Fat","C18:1 g/Kg Fat (Oleic)","C18:2 g/Kg Fat (linoleic)","C18:3 g/Kg Fat (Alpha linolenic)","Ca g/kg ","P g/kg ","Phytate P g/kg ","Mg g/kg ","K g/kg as fed","Na g/kg ","EMAn roaster MJ/Kg ","EMAn broiler MJ/kg ","%  max\n< 28 day broiler","%  max\nbroiler","%  max\n Hen","Avail. P Hen g/kg ","Avail. P broiler g/kg ","DIS LYS poultry % ","DIS THR poultry % ","DIS MET poultry % ","DIS CYS poultry % ","DIS MET+CYS poultry % ","DIS TRY poultry % ","Source "]
["Alfalfa protein concentrate",null,"Other",{"v":92,"d":"92.00"},{"v":49.20000076293945,"d":"49.20"},{"v":2.9000000953674316,"d":"2.90"},{"v":8.199999809265137,"d":"8.20"},{"v":10.100000381469727,"d":"10.10"},{"v":2.9399999618530273,"d":"2.94"},{"v":2.339999961853027,"d":"2.34"},{"v":1,"d":"1.00"},{"v":0.4699999809265137,"d":"0.47"},{"v":1.4699999809265136,"d":"1.47"},0.75,{"v":16.600000381469727,"d":"16.60"},{"v":2.799999952316284,"d":"2.80"},{"v":7.599999904632568,"d":"7.60"},{"v":29.299999237060547,"d":"29.30"},{"v":35.79999923706055,"d":"35.80"},{"v":33.70000076293945,"d":"33.70"},{"v":8.399999618530273,"d":"8.40"},{"v":0.4000000059604645,"d":"0.40"},{"v":1.399999976158142,"d":"1.40"},{"v":7,"d":"7.00"},0.07,{"v":10.96234309623431,"d":"10.96"},{"v":10.96234309623431,"d":"10.96"},{"v":5,"d":"5.00"},{"v":5,"d":"5.00"},{"v":5,"d":"5.00"},null,{"v":6.800000190734863,"d":"6.80"},{"v":2.6299999237060545,"d":"2.63"},{"v":1.9100000381469726,"d":"1.91"},{"v":0.8600000381469727,"d":"0.86"},{"v":0.2700000047683716,"d":"0.27"},{"v":1.1300000190734862,"d":"1.13"},{"v":0.6300000190734864,"d":"0.63"},"Organic table"]
["Alfalfa, dehydrated, protein < 16% ",null,"Dehydrated forage ",{"v":92.5999984741211,"d":"92.60"},{"v":13.600000381469727,"d":"13.60"},{"v":28.899999618530273,"d":"28.90"},{"v":2.200000047683716,"d":"2.20"},{"v":9.5,"d":"9.50"},{"v":0.5199999809265137,"d":"0.52"},{"v":0.45999999046325685,"d":"0.46"},{"v":0.1100000023841858,"d":"0.11"},{"v":0.1899999976158142,"d":"0.19"},{"v":0.3,"d":"0.30"},{"v":0.1899999976158142,"d":"0.19"},{"v":16.600000381469727,"d":"16.60"},{"v":2.799999952316284,"d":"2.80"},{"v":7.599999904632568,"d":"7.60"},{"v":29.299999237060547,"d":"29.30"},{"v":35.79999923706055,"d":"35.80"},{"v":17.700000762939453,"d":"17.70"},{"v":2.4000000953674316,"d":"2.40"},{"v":0.10000000149011612,"d":"0.10"},{"v":1.899999976158142,"d":"1.90"},{"v":23,"d":"23.00"},{"v":0.5600000023841858,"d":"0.56"},{"v":4.7698744769874475,"d":"4.77"},{"v":4.686192468619247,"d":"4.69"},{"v":5,"d":"5.00"},{"v":5,"d":"5.00"},{"v":5,"d":"5.00"},null,null,{"v":0.24000000953674316,"d":"0.24"},{"v":0.20999999046325685,"d":"0.21"},0.05,{"v":0.0800000011920929,"d":"0.08"},{"v":0.12999999523162842,"d":"0.13"},{"v":0.0800000011920929,"d":"0.08"},"Organic table"]
["Alfalfa, dehydrated, protein 16-18% ",null,"Dehydrated forage ",{"v":91.9000015258789,"d":"91.90"},{"v":15.600000381469727,"d":"15.60"},{"v":26.5,"d":"26.50"},{"v":2.200000047683716,"d":"2.20"},{"v":9.800000190734863,"d":"9.80"},{"v":0.6599999904632569,"d":"0.66"},{"v":0.5699999809265137,"d":"0.57"},{"v":0.1600000023841858,"d":"0.16"},{"v":0.2,"d":"0.20"},{"v":0.3599999904632568,"d":"0.36"},{"v":0.2200000047683716,"d":"0.22"},{"v":16.600000381469727,"d":"16.60"},{"v":2.799999952316284,"d":"2.80"},{"v":7.599999904632568,"d":"7.60"},{"v":29.299999237060547,"d":"29.30"},{"v":35.79999923706055,"d":"35.80"},{"v":20.5,"d":"20.50"},{"v":2.299999952316284,"d":"2.30"},{"v":0.10000000149011612,"d":"0.10"},{"v":1.7999999523162842,"d":"1.80"},{"v":23.799999237060547,"d":"23.80"},{"v":0.33000001311302185,"d":"0.33"},{"v":4.853556485355648,"d":"4.85"},{"v":4.7698744769874475,"d":"4.77"},{"v":5,"d":"5.00"},{"v":5,"d":"5.00"},{"v":5,"d":"5.00"},null,null,{"v":0.3700000047683716,"d":"0.37"},{"v":0.3099999904632568,"d":"0.31"},{"v":0.0899999976158142,"d":"0.09"},{"v":0.1,"d":"0.10"},{"v":0.1899999976158142,"d":"0.19"},{"v":0.1100000023841858,"d":"0.11"},"Organic table"]
["Alfalfa, dehydrated, protein 17-19% ",null,"Dehydrated forage ",{"v":92.0999984741211,"d":"92.10"},{"v":16.399999618530273,"d":"16.40"},{"v":25.399999618530273,"d":"25.40"},{"v":2.299999952316284,"d":"2.30"},{"v":10,"d":"10.00"},{"v":0.7199999809265136,"d":"0.72"},{"v":0.6099999904632568,"d":"0.61"},{"v":0.1799999952316284,"d":"0.18"},{"v":0.20999999046325685,"d":"0.21"},{"v":0.3900000095367432,"d":"0.39"},{"v":0.22999999523162842,"d":"0.23"},{"v":16.600000381469727,"d":"16.60"},{"v":2.799999952316284,"d":"2.80"},{"v":7.599999904632568,"d":"7.60"},{"v":29.299999237060547,"d":"29.30"},{"v":35.79999923706055,"d":"35.80"},{"v":18.799999237060547,"d":"18.80"},{"v":2.4000000953674316,"d":"2.40"},{"v":0.10000000149011612,"d":"0.10"},{"v":1.899999976158142,"d":"1.90"},{"v":22.200000762939453,"d":"22.20"},{"v":0.38999998569488525,"d":"0.39"},{"v":4.937238493723849,"d":"4.94"},{"v":4.853556485355648,"d":"4.85"},{"v":5,"d":"5.00"},{"v":5,"d":"5.00"},{"v":5,"d":"5.00"},null,null,{"v":0.4199999809265137,"d":"0.42"},0.35,{"v":0.1100000023841858,"d":"0.11"},{"v":0.1100000023841858,"d":"0.11"},{"v":0.2200000047683716,"d":"0.22"},{"v":0.12999999523162842,"d":"0.13"},"Organic table"]
["Alfalfa, dehydrated, protein 19-22% ",null,"Dehydrated forage ",{"v":92,"d":"92.00"},{"v":18.600000381469727,"d":"18.60"},{"v":23.600000381469727,"d":"23.60"},{"v":2.799999952316284,"d":"2.80"},{"v":10.600000381469727,"d":"10.60"},{"v":0.8600000381469727,"d":"0.86"},{"v":0.7199999809265136,"d":"0.72"},{"v":0.22999999523162842,"d":"0.23"},{"v":0.22999999523162842,"d":"0.23"},{"v":0.45999999046325685,"d":"0.46"},{"v":0.25999999046325684,"d":"0.26"},{"v":16.600000381469727,"d":"16.60"},{"v":2.799999952316284,"d":"2.80"},{"v":7.599999904632568,"d":"7.60"},{"v":29.299999237060547,"d":"29.30"},{"v":35.79999923706055,"d":"35.80"},{"v":20,"d":"20.00"},{"v":2.4000000953674316,"d":"2.40"},{"v":0.10000000149011612,"d":"0.10"},{"v":1.899999976158142,"d":"1.90"},{"v":23,"d":"23.00"},{"v":0.4000000059604645,"d":"0.40"},{"v":5.062761506276151,"d":"5.06"},{"v":4.937238493723849,"d":"4.94"},{"v":5,"d":"5.00"},{"v":5,"d":"5.00"},{"v":5,"d":"5.00"},null,null,{"v":0.5800000190734863,"d":"0.58"},{"v":0.4699999809265137,"d":"0.47"},{"v":0.1600000023841858,"d":"0.16"},{"v":0.13999999761581422,"d":"0.14"},{"v":0.3,"d":"0.30"},{"v":0.17000000476837157,"d":"0.17"},"Organic table"]
["Barley 10,3% CP","Orge 10,3% MAT","Cereals",{"v":87.9,"d":"87.90"},{"v":10.3,"d":"10.30"},{"v":4.7,"d":"4.70"},{"v":1.8,"d":"1.80"},{"v":2.2,"d":"2.20"},{"v":0.4,"d":"0.40"},0.37,0.18,0.24,{"v":0.42000000000000004,"d":"0.42"},0.13,{"v":21.2,"d":"21.20"},{"v":1.1,"d":"1.10"},{"v":13.4,"d":"13.40"},{"v":55.9,"d":"55.90"},{"v":8.7,"d":"8.70"},{"v":0.7,"d":"0.70"},{"v":3.4,"d":"3.40"},{"v":1.8,"d":"1.80"},{"v":1.1,"d":"1.10"},{"v":4.9,"d":"4.90"},0.03,{"v":11.5481171548117,"d":"11.55"},{"v":10.9623430962343,"d":"10.96"},{"v":10,"d":"10.00"},{"v":10,"d":"10.00"},{"v":10,"d":"10.00"},null,null,{"v":0.3,"d":"0.30"},0.26,0.15,{"v":0.16999999999999998,"d":"0.17"},0.32,{"v":0.1,"d":"0.10"},"Organic table"]
["Barley 8,3% CP","Orge 8,3% MAT","Cereals",{"v":87.9,"d":"87.90"},{"v":8.3,"d":"8.30"},{"v":4.7,"d":"4.70"},{"v":1.8,"d":"1.80"},{"v":2.2,"d":"2.20"},0.32,0.29,{"v":0.13999999999999999,"d":"0.14"},{"v":0.2,"d":"0.20"},{"v":0.33999999999999997,"d":"0.34"},{"v":0.11000000000000001,"d":"0.11"},{"v":21.2,"d":"21.20"},{"v":1.1,"d":"1.10"},{"v":13.4,"d":"13.40"},{"v":55.9,"d":"55.90"},{"v":8.7,"d":"8.70"},{"v":0.7,"d":"0.70"},{"v":3.4,"d":"3.40"},{"v":1.8,"d":"1.80"},{"v":1.1,"d":"1.10"},{"v":4.9,"d":"4.90"},0.03,{"v":11.5481171548117,"d":"11.55"},{"v":10.9623430962343,"d":"10.96"},{"v":10,"d":"10.00"},{"v":10,"d":"10.00"},{"v":10,"d":"10.00"},null,null,{"v":0.3,"d":"0.30"},0.26,0.15,{"v":0.16999999999999998,"d":"0.17"},0.32,{"v":0.1,"d":"0.10"},"Organic table"]
["Barley 9,3% CP","Orge 9,3% MAT","Cereals",{"v":87.9,"d":"87.90"},{"v":9.3,"d":"9.30"},{"v":4.7,"d":"4.70"},{"v":1.8,"d":"1.80"},{"v":2.2,"d":"2.20"},0.36,{"v":0.32999999999999996,"d":"0.33"},0.16,{"v":0.22000000000000003,"d":"0.22"},0.38,0.12,{"v":21.2,"d":"21.20"},{"v":1.1,"d":"1.10"},{"v":13.4,"d":"13.40"},{"v":55.9,"d":"55.90"},{"v":8.7,"d":"8.70"},{"v":0.7,"d":"0.70"},{"v":3.4,"d":"3.40"},{"v":1.8,"d":"1.80"},{"v":1.1,"d":"1.10"},{"v":4.9,"d":"4.90"},0.03,{"v":11.5481171548117,"d":"11.55"},{"v":10.9623430962343,"d":"10.96"},{"v":10,"d":"10.00"},{"v":10,"d":"10.00"},{"v":10,"d":"10.00"},null,"*",{"v":0.3,"d":"0.30"},0.26,0.15,{"v":0.16999999999999998,"d":"0.17"},0.32,{"v":0.1,"d":"0.10"},"Organic table"]
["Bicalcium Phosphate",null,"Minerals",{"v":97,"d":"97.00"},{"v":0,"d":"0.00"},{"v":0,"d":"0.00"},{"v":0,"d":"0.00"},{"v":88.5,"d":"88.50"},{"v":0,"d":"0.00"},{"v":0,"d":"0.00"},{"v":0,"d":"0.00"},{"v":0,"d":"0.00"},{"v":0,"d":"0.00"},{"v":0,"d":"0.00"},{"v":0,"d":"0.00"},{"v":0,"d":"0.00"},{"v":0,"d":"0.00"},{"v":0,"d":"0.00"},{"v":0,"d":"0.00"},{"v":272,"d":"272.00"},{"v":204,"d":"204.00"},{"v":0,"d":"0.00"},{"v":59,"d":"59.00"},{"v":22,"d":"22.00"},{"v":25.2,"d":"25.20"},{"v":0,"d":"0.00"},{"v":0,"d":"0.00"},{"v":5,"d":"5.00"},{"v":5,"d":"5.00"},{"v":5,"d":"5.00"},{"$nulls":8},"INRA table"]
["Blue Lupine",null,"Legume seeds",{"v":90.3,"d":"90.30"},{"v":30.3,"d":"30.30"},{"v":14.2,"d":"14.20"},{"v":5.4,"d":"5.40"},{"v":3.2,"d":"3.20"},1.53,{"v":1.1800000000000002,"d":"1.18"},0.26,0.54,{"v":0.8,"d":"0.80"},{"v":0.22000000000000003,"d":"0.22"},{"v":6.9,"d":"6.90"},{"v":3.6,"d":"3.60"},{"v":31.9,"d":"31.90"},{"v":46.7,"d":"46.70"},{"v":4.8,"d":"4.80"},{"v":26,"d":"26.00"},{"v":34,"d":"34.00"},{"v":21,"d":"21.00"},{"v":19,"d":"19.00"},{"v":99,"d":"99.00"},{"v":0.4,"d":"0.40"},{"v":8.744769874476987,"d":"8.74"},{"v":8.619246861924687,"d":"8.62"},{"v":10,"d":"10.00"},{"v":15,"d":"15.00"},{"v":5,"d":"5.00"},null,null,1.33,0.96,{"v":0.22000000000000003,"d":"0.22"},{"v":0.44000000000000006,"d":"0.44"},0.65,0.18,"INRA feed table 2002"]
["Calcium carbonate",null,"Minerals",{"v":99.9,"d":"99.90"},{"v":0,"d":"0.00"},{"v":0,"d":"0.00"},{"v":0,"d":"0.00"},{"v":99.3,"d":"99.30"},{"v":0,"d":"0.00"},{"v":0,"d":"0.00"},{"v":0,"d":"0.00"},{"v":0,"d":"0.00"},{"v":0,"d":"0.00"},{"v":0,"d":"0.00"},{"v":0,"d":"0.00"},{"v":0,"d":"0.00"},{"v":0,"d":"0.00"},{"v":0,"d":"0.00"},{"v":0,"d":"0.00"},{"v":387,"d":"387.00"},{"v":3,"d":"3.00"},{"v":0,"d":"0.00"},{"v":4,"d":"4.00"},{"v":0,"d":"0.00"},{"v":6.4,"d":"6.40"},{"v":0,"d":"0.00"},{"v":0,"d":"0.00"},{"v":5,"d":"5.00"},{"v":5,"d":"5.00"},{"v":5,"d":"5.00"},{"$nulls":8},"INRA table"]
["Camelina cake",null,"Oilseeds (Cake)",{"v":91.1,"d":"91.10"},{"v":33.2,"d":"33.20"},{"v":11.5,"d":"11.50"},{"v":14.5,"d":"14.50"},{"v":5.5,"d":"5.50"},1.54,{"v":1.3,"d":"1.30"},0.64,0.76,{"v":1.3900000000000001,"d":"1.39"},0.38,{"v":8.1,"d":"8.10"},{"v":2.5,"d":"2.50"},{"v":18.3,"d":"18.30"},{"v":24.6,"d":"24.60"},{"v":33.2,"d":"33.20"},{"v":3.4000000000000004,"d":"3.40"},{"v":8.6,"d":"8.60"},{"v":5.2,"d":"5.20"},{"v":3.5999999999999996,"d":"3.60"},{"v":12,"d":"12.00"},0.05,{"v":11.171548117154812,"d":"11.17"},{"v":10.418410041841005,"d":"10.42"},{"v":3,"d":"3.00"},{"v":5,"d":"5.00"},{"v":5,"d":"5.00"},"*",{"v":2.2,"d":"2.20"},{"v":1.1800000000000002,"d":"1.18"},0.95,0.55,0.55,{"v":1.1,"d":"1.10"},0.32,"Organic table"]
["Chickpea",null,"Legume seeds",{"v":87.9,"d":"87.90"},{"v":18.6,"d":"18.60"},{"v":3.4,"d":"3.40"},{"v":5.5,"d":"5.50"},{"v":2.9,"d":"2.90"},1.26,{"v":0.6599999999999999,"d":"0.66"},{"v":0.22999999999999998,"d":"0.23"},{"v":0.22000000000000003,"d":"0.22"},0.45,{"v":0.16999999999999998,"d":"0.17"},{"v":25.5,"d":"25.50"},{"v":1.8,"d":"1.80"},{"v":53.3,"d":"53.30"},{"v":13.1,"d":"13.10"},{"v":5.5,"d":"5.50"},{"v":12,"d":"12.00"},{"v":41,"d":"41.00"},{"v":20,"d":"20.00"},{"v":13,"d":"13.00"},{"v":96,"d":"96.00"},{"v":3.4000000000000004,"d":"3.40"},{"v":12.92887029288703,"d":"12.93"},{"v":12.677824267782427,"d":"12.68"},{"v":15,"d":"15.00"},{"v":25,"d":"25.00"},{"v":20,"d":"20.00"},null,null,0.97,0.48,0.18,{"v":0.16999999999999998,"d":"0.17"},0.35,0.13,"INRA feed table 2002"]
["Conventionnal corn gluten",null,"Cereals byproducts",{"v":87.8,"d":"87.80"},{"v":18.9,"d":"18.90"},{"v":7.9,"d":"7.90"},{"v":2.5,"d":"2.50"},{"v":5.7,"d":"5.70"},{"v":0.6,"d":"0.60"},0.65,0.32,0.35,0.67,0.13,{"v":10.5,"d":"10.50"},{"v":1.8,"d":"1.80"},{"v":26.1,"d":"26.10"},{"v":59.5,"d":"59.50"},{"v":1.3,"d":"1.30"},{"v":1.4000000000000001,"d":"1.40"},{"v":8.6,"d":"8.60"},{"v":5.6000000000000005,"d":"5.60"},{"v":3.7,"d":"3.70"},{"v":13.5,"d":"13.50"},{"v":0.8300000000000001,"d":"0.83"},{"v":7.447698744769874,"d":"7.45"},{"v":7.2803347280334725,"d":"7.28"},{"v":5,"d":"5.00"},{"v":5,"d":"5.00"},{"v":5,"d":"5.00"},null,null,{"v":0.44000000000000006,"d":"0.44"},{"v":0.49000000000000005,"d":"0.49"},0.26,0.25,0.51,{"v":0.11000000000000001,"d":"0.11"},"INRA feed table 2002"]
["Conventionnal potato protein",null,"Root byproduct",{"v":91.8,"d":"91.80"},{"v":77.2,"d":"77.20"},{"v":0.8,"d":"0.80"},{"v":0.6,"d":"0.60"},{"v":2.4,"d":"2.40"},5.89,4.34,{"v":1.7,"d":"1.70"},1.05,2.75,1.08,{"v":17.8,"d":"17.80"},{"v":5.4,"d":"5.40"},{"v":1.9,"d":"1.90"},{"v":56.5,"d":"56.50"},{"v":17.2,"d":"17.20"},{"v":2,"d":"2.00"},{"v":4.1,"d":"4.10"},{"v":0.6,"d":"0.60"},{"v":0.5,"d":"0.50"},{"v":5.4,"d":"5.40"},{"v":0.42000000000000004,"d":"0.42"},{"v":0,"d":"0.00"},{"v":0,"d":"0.00"},{"v":5,"d":"5.00"},{"v":5,"d":"5.00"},{"v":5,"d":"5.00"},null,null,5.42,3.95,1.65,0.76,2.41,0.97,"INRA feed table 2002"]
["Corn 7,6% CP","Maïs 7,6% MAT","Cereals",{"v":86.4,"d":"86.40"},{"v":7.6,"d":"7.60"},{"v":2.3,"d":"2.30"},{"v":3.3,"d":"3.30"},{"v":1.2,"d":"1.20"},{"v":0.22999999999999998,"d":"0.23"},0.29,0.16,0.19,0.35,0.05,{"v":3.2,"d":"3.20"},{"v":0.5,"d":"0.50"},{"v":7.9,"d":"7.90"},{"v":17.9,"d":"17.90"},{"v":0.4,"d":"0.40"},{"v":0.4,"d":"0.40"},{"v":2.6,"d":"2.60"},{"v":1.9,"d":"1.90"},{"v":1.1,"d":"1.10"},{"v":3.1,"d":"3.10"},{"v":0.1,"d":"0.10"},{"v":13.138075313807532,"d":"13.14"},{"v":12.887029288702928,"d":"12.89"},{"v":65,"d":"65.00"},{"v":65,"d":"65.00"},{"v":70,"d":"70.00"},"*",null,{"v":0.21000000000000002,"d":"0.21"},0.24,0.15,0.16,0.32,0.04,"Organic table"]
["Corn 8,6% CP","Maïs 8,6% MAT","Cereals",{"v":86.4,"d":"86.40"},{"v":8.6,"d":"8.60"},{"v":2.3,"d":"2.30"},{"v":3.3,"d":"3.30"},{"v":1.2,"d":"1.20"},0.26,{"v":0.32999999999999996,"d":"0.33"},0.18,{"v":0.22000000000000003,"d":"0.22"},{"v":0.4,"d":"0.40"},0.06,{"v":3.2,"d":"3.20"},{"v":0.5,"d":"0.50"},{"v":7.9,"d":"7.90"},{"v":17.9,"d":"17.90"},{"v":0.4,"d":"0.40"},{"v":0.4,"d":"0.40"},{"v":2.6,"d":"2.60"},{"v":1.9,"d":"1.90"},{"v":1.1,"d":"1.10"},{"v":3.1,"d":"3.10"},{"v":0.1,"d":"0.10"},{"v":13.138075313807532,"d":"13.14"},{"v":12.887029288702928,"d":"12.89"},{"v":65,"d":"65.00"},{"v":65,"d":"65.00"},{"v":70,"d":"70.00"},null,null,{"v":0.21000000000000002,"d":"0.21"},0.24,0.15,0.16,0.32,0.04,"Organic table"]
["Corn 9,6% CP","Maïs 9,6% MAT","Cereals",{"v":86.4,"d":"86.40"},{"v":9.6,"d":"9.60"},{"v":2.3,"d":"2.30"},{"v":3.3,"d":"3.30"},{"v":1.2,"d":"1.20"},0.29,0.37,{"v":0.2,"d":"0.20"},0.24,{"v":0.44000000000000006,"d":"0.44"},0.06,{"v":3.2,"d":"3.20"},{"v":0.5,"d":"0.50"},{"v":7.9,"d":"7.90"},{"v":17.9,"d":"17.90"},{"v":0.4,"d":"0.40"},{"v":0.4,"d":"0.40"},{"v":2.6,"d":"2.60"},{"v":1.9,"d":"1.90"},{"v":1.1,"d":"1.10"},{"v":3.1,"d":"3.10"},{"v":0.1,"d":"0.10"},{"v":13.138075313807532,"d":"13.14"},{"v":12.887029288702928,"d":"12.89"},{"v":65,"d":"65.00"},{"v":65,"d":"65.00"},{"v":70,"d":"70.00"},null,null,{"v":0.21000000000000002,"d":"0.21"},0.24,0.15,0.16,0.32,0.04,"Organic table"]
["Crepidula",null,"Fishmeals and solubles ",{"v":91.30000305175781,"d":"91.30"},{"v":47.400001525878906,"d":"47.40"},{"v":0,"d":"0.00"},{"v":2.5999999046325684,"d":"2.60"},{"v":20.100000381469727,"d":"20.10"},{"v":2.6799999237060548,"d":"2.68"},{"v":1.9700000762939454,"d":"1.97"},{"v":0.8899999618530273,"d":"0.89"},0.55,{"v":1.4300000190734863,"d":"1.43"},{"v":0,"d":"0.00"},{"v":13.5,"d":"13.50"},{"v":7.400000095367432,"d":"7.40"},{"v":6.800000190734863,"d":"6.80"},{"v":3,"d":"3.00"},{"v":1.100000023841858,"d":"1.10"},{"v":0,"d":"0.00"},{"v":4.6,"d":"4.60"},{"v":0,"d":"0.00"},{"v":0,"d":"0.00"},null,{"v":0,"d":"0.00"},{"v":10.125523012552302,"d":"10.13"},{"v":10,"d":"10.00"},{"v":5,"d":"5.00"},{"v":2,"d":"2.00"},{"v":0,"d":"0.00"},{"$nulls":8},"Organic table"]
["Faba Bean (coloured flower)",null,"Legume seeds",{"v":87.9,"d":"87.90"},{"v":25.6,"d":"25.60"},{"v":9.1,"d":"9.10"},{"v":1.1,"d":"1.10"},{"v":3.4,"d":"3.40"},1.67,{"v":0.9199999999999999,"d":"0.92"},0.18,0.32,0.51,{"v":0.21000000000000002,"d":"0.21"},{"v":17.2,"d":"17.20"},{"v":2.6,"d":"2.60"},{"v":25.8,"d":"25.80"},{"v":49.9,"d":"49.90"},{"v":3.5,"d":"3.50"},{"v":1.3,"d":"1.30"},{"v":4.9,"d":"4.90"},{"v":2.9,"d":"2.90"},{"v":1.6,"d":"1.60"},{"v":10.3,"d":"10.30"},0.11,{"v":9.581589958158995,"d":"9.58"},{"v":9.330543933054393,"d":"9.33"},{"v":0,"d":"0.00"},{"v":10,"d":"10.00"},{"v":7,"d":"7.00"},"*",{"v":1.1,"d":"1.10"},1.44,0.71,0.16,0.39,{"v":0.13999999999999999,"d":"0.14"},{"v":0.8300000000000001,"d":"0.83"},"Organic table"]
["Faba Bean (white flower)",null,"Legume seeds",{"v":84.4,"d":"84.40"},{"v":24.4,"d":"24.40"},{"v":8.6,"d":"8.60"},{"v":1,"d":"1.00"},{"v":3.4,"d":"3.40"},{"v":1.6,"d":"1.60"},{"v":0.8699999999999999,"d":"0.87"},0.18,0.31,0.48,{"v":0.2,"d":"0.20"},{"v":17.2,"d":"17.20"},{"v":2.6,"d":"2.60"},{"v":25.8,"d":"25.80"},{"v":49.9,"d":"49.90"},{"v":3.5,"d":"3.50"},{"v":1.3,"d":"1.30"},{"v":4.7,"d":"4.70"},{"v":2.8,"d":"2.80"},{"v":1.6999999999999997,"d":"1.70"},{"v":10.1,"d":"10.10"},{"v":0.1,"d":"0.10"},{"v":10.0418410041841,"d":"10.04"},{"v":9.832635983263598,"d":"9.83"},{"v":15,"d":"15.00"},{"v":20,"d":"20.00"},{"v":7,"d":"7.00"},"*",{"v":1.1,"d":"1.10"},{"v":1.3699999999999999,"d":"1.37"},{"v":0.6799999999999999,"d":"0.68"},0.15,{"v":0.22000000000000003,"d":"0.22"},0.37,0.13,"Organic table"]
["Fodder beet",null,"Individual component with low DM",{"v":16.1,"d":"16.10"},{"v":1.3,"d":"1.30"},{"v":1,"d":"1.00"},0.07,{"v":1.7,"d":"1.70"},0.07,0.06,0.02,0.01,0.04,0.02,0.06,{"v":0,"d":"0.00"},0.03,{"v":0.2,"d":"0.20"},0.03,{"v":9,"d":"9.00"},{"v":4,"d":"4.00"},{"v":0.4,"d":"0.40"},{"v":6,"d":"6.00"},{"v":50,"d":"50.00"},{"v":11,"d":"11.00"},{"v":1.6,"d":"1.60"},{"v":1.6,"d":"1.60"},{"$nulls":5},0.06,0.04,0.02,0.01,0.03,0.01,"INRA table"]
["Grass pea",null,"Legume seeds",{"v":87.9,"d":"87.90"},{"v":24.2,"d":"24.20"},{"v":6.6,"d":"6.60"},{"v":0.7,"d":"0.70"},{"v":3.1,"d":"3.10"},{"v":0.602,"d":"0.60"},{"v":0.33999999999999997,"d":"0.34"},0.09,{"v":0.16999999999999998,"d":"0.17"},0.26,0.09,{"v":10.7,"d":"10.70"},8.89,{"v":19.4,"d":"19.40"},{"v":50.4,"d":"50.40"},6.78,{"v":1,"d":"1.00"},{"v":2.6,"d":"2.60"},{"v":1.1,"d":"1.10"},{"v":1.3,"d":"1.30"},{"v":9.2,"d":"9.20"},{"v":0.2,"d":"0.20"},{"v":11.548117154811715,"d":"11.55"},{"v":11.297071129707113,"d":"11.30"},{"$nulls":5},{"v":0,"d":"0.00"},{"v":0,"d":"0.00"},{"v":0,"d":"0.00"},{"v":0,"d":"0.00"},{"v":0,"d":"0.00"},{"v":0,"d":"0.00"},"Organic table"]
["Hemp cake",null,"Oilseeds (Cake)",{"v":90.4,"d":"90.40"},{"v":30.4,"d":"30.40"},{"v":28.4,"d":"28.40"},{"v":11.1,"d":"11.10"},{"v":6.1,"d":"6.10"},1.04,1.08,{"v":0.7,"d":"0.70"},0.52,1.22,{"v":0.3,"d":"0.30"},{"v":6.6,"d":"6.60"},{"v":2.5,"d":"2.50"},{"v":11.9,"d":"11.90"},{"v":55.1,"d":"55.10"},{"v":21.4,"d":"21.40"},{"v":2.6,"d":"2.60"},{"v":9.5,"d":"9.50"},{"v":5.700000000000001,"d":"5.70"},{"v":0,"d":"0.00"},{"v":0,"d":"0.00"},null,{"v":8.99581589958159,"d":"9.00"},{"v":8.535564853556485,"d":"8.54"},{"v":10,"d":"10.00"},{"v":15,"d":"15.00"},{"v":15,"d":"15.00"},"*",{"v":2.2,"d":"2.20"},{"v":0,"d":"0.00"},{"v":0,"d":"0.00"},{"v":0,"d":"0.00"},{"v":0,"d":"0.00"},{"v":0,"d":"0.00"},{"v":0,"d":"0.00"},"Organic table"]
["Linseed meal, oil > 5%",null,"Oilseeds (Cake)",{"v":90.4000015258789,"d":"90.40"},{"v":33.400001525878906,"d":"33.40"},{"v":7.400000095367432,"d":"7.40"},{"v":12.800000190734863,"d":"12.80"},{"v":4.800000190734863,"d":"4.80"},{"v":1.3100000381469727,"d":"1.31"},{"v":1.2699999809265137,"d":"1.27"},{"v":0.6300000190734864,"d":"0.63"},{"v":0.6199999809265136,"d":"0.62"},1.25,{"v":0.5,"d":"0.50"},{"v":5.599999904632568,"d":"5.60"},{"v":4.400000095367432,"d":"4.40"},{"v":20.200000762939453,"d":"20.20"},{"v":14.699999809265137,"d":"14.70"},{"v":53.79999923706055,"d":"53.80"},{"v":3.9000000953674316,"d":"3.90"},{"v":8.399999618530273,"d":"8.40"},{"v":5.5,"d":"5.50"},{"v":4.699999809265137,"d":"4.70"},{"v":10.199999809265137,"d":"10.20"},{"v":0.6200000047683716,"d":"0.62"},{"v":11.548117154811715,"d":"11.55"},{"v":11.00418410041841,"d":"11.00"},{"v":0,"d":"0.00"},{"v":5,"d":"5.00"},{"v":5,"d":"5.00"},null,null,{"v":1.0899999618530274,"d":"1.09"},{"v":1.0100000381469727,"d":"1.01"},0.55,{"v":0.40999999046325686,"d":"0.41"},{"v":0.9699999809265136,"d":"0.97"},{"v":0.4,"d":"0.40"},"Organic table"]
["Lithotamne",null,"Minerals",{"$nulls":5},{"v":0,"d":"0.00"},{"v":0,"d":"0.00"},{"v":0,"d":"0.00"},{"v":0,"d":"0.00"},{"v":0,"d":"0.00"},{"v":0,"d":"0.00"},{"v":0,"d":"0.00"},{"v":0,"d":"0.00"},{"v":0,"d":"0.00"},{"v":0,"d":"0.00"},{"v":0,"d":"0.00"},{"v":33,"d":"33.00"},{"v":0,"d":"0.00"},{"v":0,"d":"0.00"},{"v":3.3,"d":"3.30"},{"v":0,"d":"0.00"},{"v":0,"d":"0.00"},{"v":0,"d":"0.00"},{"v":0,"d":"0.00"},{"v":5,"d":"5.00"},{"v":5,"d":"5.00"},{"v":5,"d":"5.00"},{"$nulls":8},"Organic table"]
["Molasses",null,"Other plant product",{"v":75.4,"d":"75.40"},{"v":10.7,"d":"10.70"},{"v":0,"d":"0.00"},{"v":0.2,"d":"0.20"},{"v":9.6,"d":"9.60"},0.16,{"v":0.06999999999999999,"d":"0.07"},0.02,{"v":0.06999999999999999,"d":"0.07"},0.09,0.08,{"v":0.4,"d":"0.40"},0.03,{"v":0.2,"d":"0.20"},{"v":0.6,"d":"0.60"},{"v":0.2,"d":"0.20"},{"v":0.9,"d":"0.90"},{"v":0.2,"d":"0.20"},0.02,{"v":0.2,"d":"0.20"},{"v":38.6,"d":"38.60"},5.15,{"v":9.288702928870293,"d":"9.29"},{"v":9.288702928870293,"d":"9.29"},{"$nulls":5},0.15,0.06,0.02,0.06,0.08,0.08,"INRA feed table 2002"]
["Monocalcic phosphate",null,"Minerals",{"v":98.5,"d":"98.50"},{"$nulls":3},{"v":80.5,"d":"80.50"},{"v":0,"d":"0.00"},{"v":0,"d":"0.00"},{"v":0,"d":"0.00"},{"v":0,"d":"0.00"},{"v":0,"d":"0.00"},{"v":0,"d":"0.00"},{"v":0,"d":"0.00"},{"v":0,"d":"0.00"},{"v":0,"d":"0.00"},{"v":0,"d":"0.00"},{"v":0,"d":"0.00"},{"v":167,"d":"167.00"},{"v":224,"d":"224.00"},null,{"v":4.8,"d":"4.80"},{"v":2.3,"d":"2.30"},0.72,{"v":0,"d":"0.00"},{"v":0,"d":"0.00"},{"v":5,"d":"5.00"},{"v":5,"d":"5.00"},{"v":5,"d":"5.00"},{"$nulls":8},"INRA table"]
["Oat","Avoine","Cereals",{"v":87.8000030517578,"d":"87.80"},{"v":9.399999618530273,"d":"9.40"},{"v":11.199999809265137,"d":"11.20"},{"v":4.599999904632568,"d":"4.60"},{"v":2.5999999046325684,"d":"2.60"},{"v":0.3900000095367432,"d":"0.39"},{"v":0.32999999523162843,"d":"0.33"},{"v":0.17000000476837157,"d":"0.17"},{"v":0.3099999904632568,"d":"0.31"},{"v":0.48000001907348633,"d":"0.48"},{"v":0.12000000476837158,"d":"0.12"},{"v":16.5,"d":"16.50"},{"v":1.2000000476837158,"d":"1.20"},{"v":38.599998474121094,"d":"38.60"},{"v":40.900001525878906,"d":"40.90"},{"v":1.600000023841858,"d":"1.60"},{"v":1,"d":"1.00"},{"v":3.200000047683716,"d":"3.20"},{"v":1.899999976158142,"d":"1.90"},{"v":0.8999999761581421,"d":"0.90"},{"v":4.5,"d":"4.50"},0.12,{"v":9.916317991631798,"d":"9.92"},{"v":9.372384937238493,"d":"9.37"},{"v":5,"d":"5.00"},{"v":10,"d":"10.00"},{"v":10,"d":"10.00"},{"v":0.699999988079071,"d":"0.70"},{"v":0.800000011920929,"d":"0.80"},{"v":0.32999999523162843,"d":"0.33"},{"v":0.24000000953674316,"d":"0.24"},0.15,{"v":0.20999999046325685,"d":"0.21"},{"v":0.3599999904632568,"d":"0.36"},{"v":0.0899999976158142,"d":"0.09"},"Organic table"]
["Oat dehulled","Avoine décortiqué","Cereals",{"v":85.7,"d":"85.70"},{"v":11.1,"d":"11.10"},{"v":3.9,"d":"3.90"},{"v":2.6,"d":"2.60"},{"v":2.1,"d":"2.10"},{"v":0.45999999999999996,"d":"0.46"},0.39,0.19,0.35,0.54,{"v":0.13999999999999999,"d":"0.14"},{"v":3.9,"d":"3.90"},{"v":0.3,"d":"0.30"},{"v":8.8,"d":"8.80"},{"v":8.9,"d":"8.90"},{"v":0.4,"d":"0.40"},{"v":0.9,"d":"0.90"},{"v":2.9,"d":"2.90"},{"v":1.6,"d":"1.60"},{"v":0.9,"d":"0.90"},{"v":4.5,"d":"4.50"},0.12,{"v":9.874476987447698,"d":"9.87"},{"v":9.372384937238493,"d":"9.37"},{"v":5,"d":"5.00"},{"v":10,"d":"10.00"},{"v":10,"d":"10.00"},"*",{"v":0.6,"d":"0.60"},0.41,0.31,0.18,0.25,0.43,{"v":0.11000000000000001,"d":"0.11"},"INRA feed table 2002"]
["Oat withtout hull","Avoine nue","Cereals",{"v":87.6,"d":"87.60"},{"v":9.4,"d":"9.40"},{"v":11.6,"d":"11.60"},{"v":4.7,"d":"4.70"},{"v":2.5,"d":"2.50"},{"v":0.4,"d":"0.40"},{"v":0.32999999999999996,"d":"0.33"},{"v":0.16999999999999998,"d":"0.17"},0.31,{"v":0.49000000000000005,"d":"0.49"},0.12,{"v":16.6,"d":"16.60"},{"v":1.2,"d":"1.20"},{"v":37.1,"d":"37.10"},{"v":37.5,"d":"37.50"},{"v":1.5,"d":"1.50"},{"v":1,"d":"1.00"},{"v":3.1,"d":"3.10"},{"v":1.7,"d":"1.70"},{"v":0.9,"d":"0.90"},{"v":4.5,"d":"4.50"},0.12,{"v":11.799163179916318,"d":"11.80"},{"v":11.213389121338912,"d":"11.21"},{"v":5,"d":"5.00"},{"v":10,"d":"10.00"},{"v":10,"d":"10.00"},"*","*",0.41,0.31,0.18,0.25,0.43,{"v":0.11000000000000001,"d":"0.11"},"INRA feed table 2002"]
["Okara, fat > 5%",null,"Other plant product ",{"v":94.4000015258789,"d":"94.40"},{"v":30.700000762939453,"d":"30.70"},{"v":10,"d":"10.00"},{"v":11.699999809265137,"d":"11.70"},{"v":4.300000190734863,"d":"4.30"},{"v":1.7899999618530273,"d":"1.79"},{"v":1.3100000381469727,"d":"1.31"},{"v":0.4400000095367432,"d":"0.44"},{"v":0.43000001907348634,"d":"0.43"},{"v":0.8699999809265136,"d":"0.87"},{"v":0.4199999809265137,"d":"0.42"},{"v":11.199999809265137,"d":"11.20"},{"v":3.799999952316284,"d":"3.80"},{"v":23.100000381469727,"d":"23.10"},{"v":54,"d":"54.00"},{"v":7.199999809265137,"d":"7.20"},{"v":3.5,"d":"3.50"},{"v":5.199999809265137,"d":"5.20"},{"v":3.0999999046325684,"d":"3.10"},{"$nulls":3},{"v":11.92468619246862,"d":"11.92"},{"v":11.589958158995817,"d":"11.59"},{"v":50,"d":"50.00"},{"v":50,"d":"50.00"},{"v":50,"d":"50.00"},null,null,{"v":0,"d":"0.00"},{"v":0,"d":"0.00"},{"v":0,"d":"0.00"},{"v":0,"d":"0.00"},{"v":0,"d":"0.00"},{"v":0,"d":"0.00"},"Organic table"]
["Oyster shells",null,"Minerals",{"v":99.6,"d":"99.60"},{"$nulls":3},{"v":95.8,"d":"95.80"},{"v":0,"d":"0.00"},{"v":0,"d":"0.00"},{"v":0,"d":"0.00"},{"v":0,"d":"0.00"},{"v":0,"d":"0.00"},{"v":0,"d":"0.00"},{"v":0,"d":"0.00"},{"v":0,"d":"0.00"},{"v":0,"d":"0.00"},{"v":0,"d":"0.00"},{"v":0,"d":"0.00"},{"v":350,"d":"350.00"},null,null,{"v":10.1,"d":"10.10"},null,{"v":5.2,"d":"5.20"},{"v":0,"d":"0.00"},{"v":0,"d":"0.00"},{"v":5,"d":"5.00"},{"v":5,"d":"5.00"},{"v":5,"d":"5.00"},null,null,{"v":0,"d":"0.00"},{"v":0,"d":"0.00"},{"v":0,"d":"0.00"},{"v":0,"d":"0.00"},{"v":0,"d":"0.00"},{"v":0,"d":"0.00"},"Organic table"]
["pea (coloured)",null,"Legume seeds",{"v":86.1,"d":"86.10"},{"v":21,"d":"21.00"},{"v":6.2,"d":"6.20"},{"v":1.3,"d":"1.30"},{"v":2.7,"d":"2.70"},1.52,0.79,{"v":0.2,"d":"0.20"},{"v":0.27999999999999997,"d":"0.28"},0.48,0.18,{"v":14.3,"d":"14.30"},{"v":3.8,"d":"3.80"},{"v":24.8,"d":"24.80"},{"v":47.3,"d":"47.30"},{"v":8.8,"d":"8.80"},{"v":2.2,"d":"2.20"},{"v":4.2,"d":"4.20"},{"v":1.9,"d":"1.90"},{"v":1.5,"d":"1.50"},{"v":9.9,"d":"9.90"},0.04,{"v":10.334728033472803,"d":"10.33"},{"v":10.083682008368202,"d":"10.08"},{"v":0,"d":"0.00"},{"v":25,"d":"25.00"},{"v":20,"d":"20.00"},"*",{"v":1.1,"d":"1.10"},{"v":0,"d":"0.00"},{"v":0,"d":"0.00"},{"v":0,"d":"0.00"},{"v":0,"d":"0.00"},{"v":0,"d":"0.00"},{"v":0,"d":"0.00"},"Organic table"]
["pea (white)",null,"Legume seeds",{"v":87.5,"d":"87.50"},{"v":20.7,"d":"20.70"},{"v":6.1,"d":"6.10"},{"v":1.2,"d":"1.20"},{"v":3,"d":"3.00"},1.51,0.79,{"v":0.2,"d":"0.20"},{"v":0.27999999999999997,"d":"0.28"},0.48,0.18,{"v":14.3,"d":"14.30"},{"v":3.8,"d":"3.80"},{"v":24.8,"d":"24.80"},{"v":47.3,"d":"47.30"},{"v":8.8,"d":"8.80"},{"v":1.1,"d":"1.10"},{"v":4.3,"d":"4.30"},{"v":2,"d":"2.00"},{"v":1.1,"d":"1.10"},{"v":9.9,"d":"9.90"},0.04,{"v":10.502092050209205,"d":"10.50"},{"v":10.251046025104603,"d":"10.25"},{"v":15,"d":"15.00"},{"v":25,"d":"25.00"},{"v":20,"d":"20.00"},"*",{"v":1.1,"d":"1.10"},{"v":1.3699999999999999,"d":"1.37"},0.67,0.18,{"v":0.22000000000000003,"d":"0.22"},{"v":0.4,"d":"0.40"},{"v":0.13999999999999999,"d":"0.14"},"Organic table"]
["Rape oil",null,"Oil",{"v":99.9,"d":"99.90"},{"v":0,"d":"0.00"},{"v":0,"d":"0.00"},{"v":99.6,"d":"99.60"},{"v":0.2,"d":"0.20"},{"v":0,"d":"0.00"},{"v":0,"d":"0.00"},{"v":0,"d":"0.00"},{"v":0,"d":"0.00"},{"v":0,"d":"0.00"},{"v":0,"d":"0.00"},{"v":4.8,"d":"4.80"},{"v":1.6,"d":"1.60"},{"v":59.9,"d":"59.90"},{"v":20.4,"d":"20.40"},{"v":9.2,"d":"9.20"},{"$nulls":5},0.07,{"v":0,"d":"0.00"},{"v":0,"d":"0.00"},{"v":4,"d":"4.00"},{"v":4,"d":"4.00"},{"v":2,"d":"2.00"},null,null,{"v":0,"d":"0.00"},{"v":0,"d":"0.00"},{"v":0,"d":"0.00"},{"v":0,"d":"0.00"},{"v":0,"d":"0.00"},{"v":0,"d":"0.00"},"INRA feed table 2002"]
["Rapeseed",null,"Legume seeds",{"v":92.4,"d":"92.40"},{"v":18.7,"d":"18.70"},{"v":8.5,"d":"8.50"},{"v":44,"d":"44.00"},{"v":4,"d":"4.00"},1.16,0.89,0.41,{"v":0.47000000000000003,"d":"0.47"},{"v":0.8800000000000001,"d":"0.88"},0.24,{"v":4.8,"d":"4.80"},{"v":1.6,"d":"1.60"},{"v":59.9,"d":"59.90"},{"v":20.4,"d":"20.40"},{"v":9.2,"d":"9.20"},{"v":4.5,"d":"4.50"},{"v":6.7,"d":"6.70"},{"v":4.7,"d":"4.70"},{"v":2.4,"d":"2.40"},{"v":7.8,"d":"7.80"},0.06,{"v":14.853556485355648,"d":"14.85"},{"v":18.284518828451883,"d":"18.28"},{"v":5,"d":"5.00"},{"v":5,"d":"5.00"},{"v":5,"d":"5.00"},null,"*",{"v":0.9,"d":"0.90"},0.67,0.36,{"v":0.33999999999999997,"d":"0.34"},{"v":0.7,"d":"0.70"},{"v":0.2,"d":"0.20"},"INRA feed table 2002"]
["Rapeseed cake (low fat)",null,"Oilseeds (Cake)",{"v":90.4,"d":"90.40"},{"v":33.4,"d":"33.40"},{"v":7.4,"d":"7.40"},{"v":12.8,"d":"12.80"},{"v":4.8,"d":"4.80"},1.31,1.27,0.63,0.62,1.24,{"v":0.5,"d":"0.50"},{"v":5.6,"d":"5.60"},{"v":4.4,"d":"4.40"},{"v":20.2,"d":"20.20"},{"v":14.7,"d":"14.70"},{"v":53.8,"d":"53.80"},{"v":3.9,"d":"3.90"},{"v":8.4,"d":"8.40"},{"v":5.5,"d":"5.50"},{"v":4.7,"d":"4.70"},{"v":11.6,"d":"11.60"},0.61,{"v":11.548117154811715,"d":"11.55"},{"v":11.00418410041841,"d":"11.00"},{"v":5,"d":"5.00"},{"v":10,"d":"10.00"},{"v":6,"d":"6.00"},"*",null,1.09,1.01,0.55,0.41,0.96,{"v":0.4,"d":"0.40"},"Organic table"]
["Rapeseed meal, oil > 5%, organic",null,"Legume seeds",{"v":91.5,"d":"91.50"},{"v":29.700000762939453,"d":"29.70"},{"v":11.5,"d":"11.50"},{"v":14.199999809265137,"d":"14.20"},{"v":6.300000190734863,"d":"6.30"},{"v":1.6399999618530274,"d":"1.64"},{"v":1.3,"d":"1.30"},{"v":0.6,"d":"0.60"},{"v":0.7199999809265136,"d":"0.72"},{"v":1.3199999809265137,"d":"1.32"},{"v":0.3700000047683716,"d":"0.37"},{"v":4.699999809265137,"d":"4.70"},{"v":1.600000023841858,"d":"1.60"},{"v":60.400001525878906,"d":"60.40"},{"v":20,"d":"20.00"},{"v":9.199999809265137,"d":"9.20"},{"v":7.5,"d":"7.50"},{"v":10.899999618530273,"d":"10.90"},{"v":6.5,"d":"6.50"},{"v":4.800000190734863,"d":"4.80"},{"v":11.399999618530273,"d":"11.40"},{"v":0.5099999904632568,"d":"0.51"},{"v":11.087866108786612,"d":"11.09"},{"v":9.456066945606695,"d":"9.46"},{"v":5,"d":"5.00"},{"v":10,"d":"10.00"},{"v":6,"d":"6.00"},null,null,{"v":1.2800000190734864,"d":"1.28"},{"v":0.9800000190734863,"d":"0.98"},{"v":0.5300000190734864,"d":"0.53"},{"v":0.5199999809265137,"d":"0.52"},{"v":1.0600000381469727,"d":"1.06"},{"v":0.3,"d":"0.30"},"Organic table"]
["Red clover",null,"ndividual component with low DM",{"v":27.1,"d":"27.10"},{"v":13.7,"d":"13.70"},{"v":28.3,"d":"28.30"},{"v":37,"d":"37.00"},{"v":13,"d":"13.00"},0.41,0.34,0.16,0.06,0.22,{"v":0,"d":"0.00"},{"v":0,"d":"0.00"},{"v":0,"d":"0.00"},{"v":0,"d":"0.00"},{"v":0,"d":"0.00"},{"v":0,"d":"0.00"},{"v":9.1,"d":"9.10"},{"v":2.6,"d":"2.60"},null,{"v":2.1,"d":"2.10"},{"v":34.1,"d":"34.10"},{"v":0.3,"d":"0.30"},{"v":3.2,"d":"3.20"},{"v":0,"d":"0.00"},{"$nulls":5},0.25,{"v":0,"d":"0.00"},{"v":0.1,"d":"0.10"},0.03,{"v":0,"d":"0.00"},{"v":0,"d":"0.00"},"ICOPP MTT"]
["Rice protein concentrate",null,"Other plant product",{"v":94.80000305175781,"d":"94.80"},{"v":46.5,"d":"46.50"},{"v":1.2000000476837158,"d":"1.20"},{"v":3.5999999046325684,"d":"3.60"},{"v":2.299999952316284,"d":"2.30"},{"v":1.4699999809265136,"d":"1.47"},{"v":1.6899999618530273,"d":"1.69"},{"v":1.3300000190734864,"d":"1.33"},{"v":1.0199999809265137,"d":"1.02"},2.35,{"v":0.6199999809265136,"d":"0.62"},{"v":18.799999237060547,"d":"18.80"},{"v":2.0999999046325684,"d":"2.10"},{"v":39.900001525878906,"d":"39.90"},{"v":35.79999923706055,"d":"35.80"},{"v":1.5,"d":"1.50"},{"v":1,"d":"1.00"},{"v":4.5,"d":"4.50"},{"v":3.9000000953674316,"d":"3.90"},{"v":0.4000000059604645,"d":"0.40"},{"v":0.20000000298023224,"d":"0.20"},{"v":0.9599999785423279,"d":"0.96"},{"v":9.414225941422593,"d":"9.41"},{"v":9.414225941422593,"d":"9.41"},{"v":5,"d":"5.00"},{"v":5,"d":"5.00"},{"v":5,"d":"5.00"},null,null,{"v":0,"d":"0.00"},{"v":0,"d":"0.00"},{"v":0,"d":"0.00"},{"v":0,"d":"0.00"},{"v":0,"d":"0.00"},{"v":0,"d":"0.00"},"Organic table"]
["Rye","Seigle","Cereals",{"v":84.2,"d":"84.20"},{"v":9.3,"d":"9.30"},{"v":2.1,"d":"2.10"},{"v":1.1,"d":"1.10"},{"v":1.7,"d":"1.70"},0.35,0.32,0.15,0.21,0.36,0.08,{"v":14.9,"d":"14.90"},{"v":0.8,"d":"0.80"},{"v":18.1,"d":"18.10"},{"v":57.7,"d":"57.70"},{"v":7.1,"d":"7.10"},0.06,0.29,{"v":1.9,"d":"1.90"},{"v":1,"d":"1.00"},{"v":4.4,"d":"4.40"},0.03,{"v":11.087866108786612,"d":"11.09"},{"v":9.497907949790795,"d":"9.50"},{"v":15,"d":"15.00"},{"v":15,"d":"15.00"},{"v":25,"d":"25.00"},"*","*",0.25,{"v":0.16999999999999998,"d":"0.17"},0.12,0.12,0.24,0.04,"Organic table"]
["Sesame oil meal, oil > 5%",null,"Oilseeds (Cake)",{"v":93.5999984741211,"d":"93.60"},{"v":43.20000076293945,"d":"43.20"},{"v":6.599999904632568,"d":"6.60"},{"v":14.300000190734863,"d":"14.30"},{"v":8.600000381469727,"d":"8.60"},{"v":1.0100000381469727,"d":"1.01"},{"v":1.2800000190734864,"d":"1.28"},{"v":1.1100000381469726,"d":"1.11"},{"v":0.7699999809265137,"d":"0.77"},{"v":1.8799999237060547,"d":"1.88"},{"v":0.48000001907348633,"d":"0.48"},{"v":8.800000190734863,"d":"8.80"},{"v":4.900000095367432,"d":"4.90"},{"v":38.900001525878906,"d":"38.90"},{"v":43.70000076293945,"d":"43.70"},{"v":0.4000000059604645,"d":"0.40"},{"v":18.700000762939453,"d":"18.70"},{"v":11.5,"d":"11.50"},{"v":8.600000381469727,"d":"8.60"},{"v":5.599999904632568,"d":"5.60"},{"v":9.699999809265137,"d":"9.70"},{"v":0.05999999865889549,"d":"0.06"},{"v":11.673640167364017,"d":"11.67"},{"v":11.087866108786612,"d":"11.09"},{"v":10,"d":"10.00"},{"v":15,"d":"15.00"},{"v":15,"d":"15.00"},null,null,{"v":0.8100000381469726,"d":"0.81"},{"v":0.9800000190734863,"d":"0.98"},{"v":0.9800000190734863,"d":"0.98"},{"v":0.5300000190734864,"d":"0.53"},{"v":1.5100000381469727,"d":"1.51"},{"v":0.4,"d":"0.40"},"Organic table"]
["Sodium chlorite",null,"Minerals",{"v":99.6,"d":"99.60"},{"v":0,"d":"0.00"},{"v":0,"d":"0.00"},{"v":0,"d":"0.00"},{"v":99.3,"d":"99.30"},{"v":0,"d":"0.00"},{"v":0,"d":"0.00"},{"v":0,"d":"0.00"},{"v":0,"d":"0.00"},{"v":0,"d":"0.00"},{"v":0,"d":"0.00"},{"v":0,"d":"0.00"},{"v":0,"d":"0.00"},{"v":0,"d":"0.00"},{"v":0,"d":"0.00"},null,{"v":0,"d":"0.00"},{"v":0,"d":"0.00"},null,{"v":0,"d":"0.00"},null,{"v":380,"d":"380.00"},{"v":0,"d":"0.00"},{"v":0,"d":"0.00"},{"v":5,"d":"5.00"},{"v":5,"d":"5.00"},{"v":5,"d":"5.00"},{"$nulls":8},"Organic table"]
["Sorghum ","Sorghum","Cereals",{"v":87.69999694824219,"d":"87.70"},{"v":9,"d":"9.00"},{"v":3.5,"d":"3.50"},{"v":2.9000000953674316,"d":"2.90"},{"v":1.899999976158142,"d":"1.90"},{"v":2.200000047683716,"d":"2.20"},{"v":3,"d":"3.00"},{"v":1.5,"d":"1.50"},{"v":1.7000000476837158,"d":"1.70"},{"v":3.200000047683716,"d":"3.20"},{"v":0.8999999761581421,"d":"0.90"},{"v":14.300000190734863,"d":"14.30"},{"v":1.7000000476837158,"d":"1.70"},{"v":38.20000076293945,"d":"38.20"},{"v":42.20000076293945,"d":"42.20"},{"v":1.7999999523162842,"d":"1.80"},{"v":0.30000001192092896,"d":"0.30"},{"v":3,"d":"3.00"},{"v":2.0999999046325684,"d":"2.10"},{"v":1.5,"d":"1.50"},{"v":3.5999999046325684,"d":"3.60"},{"v":0.1599999964237213,"d":"0.16"},{"v":13.723849372384937,"d":"13.72"},{"v":13.472803347280335,"d":"13.47"},{"v":15,"d":"15.00"},{"v":65,"d":"65.00"},{"v":70,"d":"70.00"},null,null,{"v":0.1899999976158142,"d":"0.19"},0.25,{"v":0.12999999523162842,"d":"0.13"},{"v":0.1600000023841858,"d":"0.16"},{"v":0.29000000953674315,"d":"0.29"},{"v":0.0800000011920929,"d":"0.08"},"Organic table"]
["Soya bean ",null,"Legume seeds",{"v":88.19999694824219,"d":"88.20"},{"v":35.70000076293945,"d":"35.70"},{"v":6.300000190734863,"d":"6.30"},{"v":18.600000381469727,"d":"18.60"},{"v":4.599999904632568,"d":"4.60"},{"v":2.220000076293945,"d":"2.22"},{"v":1.4399999618530273,"d":"1.44"},{"v":0.5199999809265137,"d":"0.52"},{"v":0.5300000190734864,"d":"0.53"},{"v":1.0399999618530273,"d":"1.04"},0.45,{"v":11.199999809265137,"d":"11.20"},{"v":3.799999952316284,"d":"3.80"},{"v":23.100000381469727,"d":"23.10"},{"v":54,"d":"54.00"},{"v":7.199999809265137,"d":"7.20"},{"v":2.9000000953674316,"d":"2.90"},{"v":5.400000095367432,"d":"5.40"},{"v":3.299999952316284,"d":"3.30"},{"v":2,"d":"2.00"},{"v":16.6,"d":"16.60"},0.06,{"v":0,"d":"0.00"},{"v":0,"d":"0.00"},{"v":15,"d":"15.00"},{"v":20,"d":"20.00"},{"v":20,"d":"20.00"},null,null,{"v":0,"d":"0.00"},{"v":0,"d":"0.00"},{"v":0,"d":"0.00"},{"v":0,"d":"0.00"},{"v":0,"d":"0.00"},{"v":0,"d":"0.00"},"Organic table"]
["Soya bean thermically treated",null,"Legume seeds",{"v":90.69999694824219,"d":"90.70"},{"v":37.599998474121094,"d":"37.60"},{"v":4.199999809265137,"d":"4.20"},{"v":17.5,"d":"17.50"},{"v":5.199999809265137,"d":"5.20"},{"v":2.339999961853027,"d":"2.34"},{"v":1.5100000381469727,"d":"1.51"},{"v":0.5400000095367432,"d":"0.54"},{"v":0.5599999904632569,"d":"0.56"},{"v":1.1,"d":"1.10"},{"v":0.48000001907348633,"d":"0.48"},{"v":11.199999809265137,"d":"11.20"},{"v":3.799999952316284,"d":"3.80"},{"v":23.100000381469727,"d":"23.10"},{"v":54,"d":"54.00"},{"v":7.199999809265137,"d":"7.20"},{"v":3,"d":"3.00"},{"v":5.5,"d":"5.50"},{"v":3.299999952316284,"d":"3.30"},{"v":2.299999952316284,"d":"2.30"},{"v":18.3,"d":"18.30"},0.05,{"v":13.263598326359833,"d":"13.26"},{"v":12.887029288702928,"d":"12.89"},{"v":15,"d":"15.00"},{"v":20,"d":"20.00"},{"v":20,"d":"20.00"},null,null,{"v":1.9899999618530273,"d":"1.99"},{"v":1.1600000381469726,"d":"1.16"},{"v":0.45999999046325685,"d":"0.46"},{"v":0.3799999952316284,"d":"0.38"},{"v":0.8399999618530274,"d":"0.84"},{"v":0.3599999904632568,"d":"0.36"},"Organic table"]
["Soya bean toasted",null,"Legume seeds","88.6.",{"v":35.7,"d":"35.70"},{"v":5.8,"d":"5.80"},{"v":19.7,"d":"19.70"},{"v":4.9,"d":"4.90"},{"v":2.2199999999999998,"d":"2.22"},1.44,0.52,0.53,1.04,0.45,{"v":10.5,"d":"10.50"},{"v":3.8,"d":"3.80"},{"v":21.7,"d":"21.70"},{"v":53.1,"d":"53.10"},{"v":7.4,"d":"7.40"},{"v":3,"d":"3.00"},{"v":5.3,"d":"5.30"},{"v":3.2,"d":"3.20"},{"v":2.2,"d":"2.20"},{"v":17.5,"d":"17.50"},0.06,{"v":13.891213389121338,"d":"13.89"},{"v":14.267782426778243,"d":"14.27"},{"v":15,"d":"15.00"},{"v":20,"d":"20.00"},{"v":20,"d":"20.00"},null,null,1.89,{"v":1.1099999999999999,"d":"1.11"},0.43,0.36,0.79,{"v":0.33999999999999997,"d":"0.34"},"INRA feed table 2002"]
["Soya oil",null,"Oil",{"v":99.8,"d":"99.80"},{"v":0,"d":"0.00"},{"v":0,"d":"0.00"},{"v":99.7,"d":"99.70"},{"v":0,"d":"0.00"},{"v":0,"d":"0.00"},{"v":0,"d":"0.00"},{"v":0,"d":"0.00"},{"v":0,"d":"0.00"},{"v":0,"d":"0.00"},{"v":0,"d":"0.00"},{"v":10.5,"d":"10.50"},{"v":3.8,"d":"3.80"},{"v":21.7,"d":"21.70"},{"v":53.1,"d":"53.10"},{"v":7.4,"d":"7.40"},null,{"v":0,"d":"0.00"},{"v":0,"d":"0.00"},{"v":0,"d":"0.00"},{"v":0.2,"d":"0.20"},0.08,{"v":0,"d":"0.00"},{"v":37.57322175732217,"d":"37.57"},{"v":4,"d":"4.00"},{"v":4,"d":"4.00"},{"v":3,"d":"3.00"},null,null,{"v":0,"d":"0.00"},{"v":0,"d":"0.00"},{"v":0,"d":"0.00"},{"v":0,"d":"0.00"},{"v":0,"d":"0.00"},{"v":0,"d":"0.00"},"INRA feed table 2002"]
["Soyabean cake (high protein)",null,"Oilseeds (Cake)",{"v":94.4000015258789,"d":"94.40"},{"v":46.20000076293945,"d":"46.20"},{"v":5.900000095367432,"d":"5.90"},{"v":8.699999809265137,"d":"8.70"},{"v":6.199999809265137,"d":"6.20"},{"v":2.6,"d":"2.60"},{"v":1.7899999618530273,"d":"1.79"},{"v":0.6599999904632569,"d":"0.66"},{"v":0.7099999904632568,"d":"0.71"},{"v":1.3800000190734862,"d":"1.38"},{"v":0.6300000190734864,"d":"0.63"},{"v":11.199999809265137,"d":"11.20"},{"v":3.799999952316284,"d":"3.80"},{"v":23.100000381469727,"d":"23.10"},{"v":54,"d":"54.00"},{"v":7.199999809265137,"d":"7.20"},{"v":3.5,"d":"3.50"},{"v":6.599999904632568,"d":"6.60"},{"v":3.9000000953674316,"d":"3.90"},{"v":2.799999952316284,"d":"2.80"},{"v":21.200000762939453,"d":"21.20"},{"v":0,"d":"0.00"},{"v":12.00836820083682,"d":"12.01"},{"v":11.548117154811715,"d":"11.55"},{"v":100,"d":"100.00"},{"v":100,"d":"100.00"},{"v":100,"d":"100.00"},null,{"v":1.399999976158142,"d":"1.40"},{"v":2.2899999618530273,"d":"2.29"},{"v":1.4899999618530273,"d":"1.49"},{"v":0.5900000095367431,"d":"0.59"},{"v":0.5400000095367432,"d":"0.54"},{"v":1.1300000190734862,"d":"1.13"},{"v":0.5599999904632569,"d":"0.56"},"Organic table"]
["Soyabean cake (low protein)",null,"Oilseeds (Cake)",{"v":92.5999984741211,"d":"92.60"},{"v":42,"d":"42.00"},{"v":6.099999904632568,"d":"6.10"},{"v":8.899999618530273,"d":"8.90"},{"v":6,"d":"6.00"},{"v":2.3700000762939455,"d":"2.37"},1.65,{"v":0.6,"d":"0.60"},{"v":0.6400000095367432,"d":"0.64"},{"v":1.2399999618530273,"d":"1.24"},{"v":0.5599999904632569,"d":"0.56"},{"v":11.199999809265137,"d":"11.20"},{"v":3.799999952316284,"d":"3.80"},{"v":23.100000381469727,"d":"23.10"},{"v":54,"d":"54.00"},{"v":7.199999809265137,"d":"7.20"},{"v":3.4000000953674316,"d":"3.40"},{"v":6.400000095367432,"d":"6.40"},{"v":3.799999952316284,"d":"3.80"},{"v":2.700000047683716,"d":"2.70"},{"v":20.5,"d":"20.50"},0.01,{"v":11.757322175732218,"d":"11.76"},{"v":11.297071129707113,"d":"11.30"},{"v":100,"d":"100.00"},{"v":100,"d":"100.00"},{"v":100,"d":"100.00"},null,{"v":1.399999976158142,"d":"1.40"},{"v":2.0799999237060547,"d":"2.08"},{"v":1.3699999809265138,"d":"1.37"},{"v":0.5400000095367432,"d":"0.54"},{"v":0.48000001907348633,"d":"0.48"},{"v":1.0199999809265137,"d":"1.02"},{"v":0.5,"d":"0.50"},"Organic table"]
["Spelt",null,"Cereals",{"v":86.9000015258789,"d":"86.90"},{"v":9.899999618530273,"d":"9.90"},{"v":11.100000381469727,"d":"11.10"},{"v":1.2999999523162842,"d":"1.30"},{"v":2.700000047683716,"d":"2.70"},{"v":3,"d":"3.00"},{"v":3,"d":"3.00"},{"v":1.600000023841858,"d":"1.60"},{"v":2.299999952316284,"d":"2.30"},{"v":3.9000000953674316,"d":"3.90"},{"v":1.2000000476837158,"d":"1.20"},{"v":17.799999237060547,"d":"17.80"},{"v":0.800000011920929,"d":"0.80"},{"v":15.199999809265137,"d":"15.20"},{"v":56.400001525878906,"d":"56.40"},{"v":5.900000095367432,"d":"5.90"},{"v":0.800000011920929,"d":"0.80"},{"v":3.700000047683716,"d":"3.70"},{"v":2.4000000953674316,"d":"2.40"},{"v":1.600000023841858,"d":"1.60"},{"v":1.899999976158142,"d":"1.90"},{"v":0.10999999940395355,"d":"0.11"},{"v":10.627615062761507,"d":"10.63"},{"v":10.167364016736402,"d":"10.17"},{"$nulls":5},{"v":0,"d":"0.00"},{"v":0,"d":"0.00"},{"v":0,"d":"0.00"},{"v":0,"d":"0.00"},{"v":0,"d":"0.00"},{"v":0,"d":"0.00"},"Organic table"]
["Sunflower bean",null,"Legume seeds",{"v":93.5999984741211,"d":"93.60"},{"v":15.199999809265137,"d":"15.20"},{"v":14.399999618530273,"d":"14.40"},{"v":45.099998474121094,"d":"45.10"},{"v":3.0999999046325684,"d":"3.10"},{"v":0.6199999809265136,"d":"0.62"},{"v":0.5800000190734863,"d":"0.58"},0.35,{"v":0.2700000047683716,"d":"0.27"},{"v":0.6099999904632568,"d":"0.61"},{"v":0.20999999046325685,"d":"0.21"},{"v":6.400000095367432,"d":"6.40"},{"v":4.300000190734863,"d":"4.30"},{"v":20.200000762939453,"d":"20.20"},{"v":65.19999694824219,"d":"65.20"},{"v":0.30000001192092896,"d":"0.30"},{"v":2.5999999046325684,"d":"2.60"},{"v":5.099999904632568,"d":"5.10"},{"v":4.300000190734863,"d":"4.30"},{"v":2.700000047683716,"d":"2.70"},{"v":7.7,"d":"7.70"},0.05,{"v":18.535564853556487,"d":"18.54"},{"v":17.489539748953973,"d":"17.49"},{"v":5,"d":"5.00"},{"v":5,"d":"5.00"},{"v":5,"d":"5.00"},null,null,0,0,0,0,0,0,"Organic table"]
["Sunflower cake (dehulled)",null,"Oilseeds (Cake)",{"v":93.8,"d":"93.80"},{"v":33.7,"d":"33.70"},{"v":18.5,"d":"18.50"},{"v":8.8,"d":"8.80"},{"v":6.2,"d":"6.20"},1.21,1.22,0.76,{"v":0.5700000000000001,"d":"0.57"},{"v":1.3199999999999998,"d":"1.32"},0.43,{"v":6.3,"d":"6.30"},{"v":4.3,"d":"4.30"},{"v":20.3,"d":"20.30"},{"v":64.9,"d":"64.90"},{"v":0.3,"d":"0.30"},{"v":3.9,"d":"3.90"},{"v":9.9,"d":"9.90"},{"v":8.4,"d":"8.40"},{"v":4.9,"d":"4.90"},{"v":13.2,"d":"13.20"},{"v":0,"d":"0.00"},{"v":7.2803347280334725,"d":"7.28"},{"v":6.903765690376569,"d":"6.90"},{"v":8,"d":"8.00"},{"v":20,"d":"20.00"},{"v":15,"d":"15.00"},null,null,0.99,{"v":0.9199999999999999,"d":"0.92"},{"v":0.6900000000000001,"d":"0.69"},0.39,1.09,0.36,"INRA feed table 2002"]
["Sunflower cake (high protein)",null,"Oilseeds (Cake)",{"v":94.19999694824219,"d":"94.20"},{"v":33.29999923706055,"d":"33.30"},{"v":18.899999618530273,"d":"18.90"},{"v":8.600000381469727,"d":"8.60"},{"v":6,"d":"6.00"},{"v":1.2,"d":"1.20"},{"v":1.2,"d":"1.20"},0.75,{"v":0.5599999904632569,"d":"0.56"},{"v":1.3100000381469727,"d":"1.31"},{"v":0.4199999809265137,"d":"0.42"},{"v":6.400000095367432,"d":"6.40"},{"v":4.300000190734863,"d":"4.30"},{"v":20.200000762939453,"d":"20.20"},{"v":65.19999694824219,"d":"65.20"},{"v":0.30000001192092896,"d":"0.30"},{"v":3.9000000953674316,"d":"3.90"},{"v":9.699999809265137,"d":"9.70"},{"v":8.300000190734863,"d":"8.30"},{"v":4.800000190734863,"d":"4.80"},{"v":14.1,"d":"14.10"},0.12,{"v":10.0418410041841,"d":"10.04"},{"v":9.665271966527197,"d":"9.67"},{"v":8,"d":"8.00"},{"v":20,"d":"20.00"},{"v":15,"d":"15.00"},null,{"v":1.7000000476837158,"d":"1.70"},{"v":0.9800000190734863,"d":"0.98"},{"v":0.9100000381469726,"d":"0.91"},{"v":0.6900000095367431,"d":"0.69"},{"v":0.40999999046325686,"d":"0.41"},{"v":1.1,"d":"1.10"},{"v":0.3599999904632568,"d":"0.36"},"Organic table"]
["Sunflower cake (low protein)",null,"Oilseeds (Cake)",{"v":92.30000305175781,"d":"92.30"},{"v":24.100000381469727,"d":"24.10"},{"v":24.600000381469727,"d":"24.60"},{"v":14.899999618530273,"d":"14.90"},{"v":5.300000190734863,"d":"5.30"},{"v":0.9,"d":"0.90"},{"v":0.8899999618530273,"d":"0.89"},{"v":0.5400000095367432,"d":"0.54"},{"v":0.40999999046325686,"d":"0.41"},{"v":0.9600000381469727,"d":"0.96"},{"v":0.3099999904632568,"d":"0.31"},{"v":6.400000095367432,"d":"6.40"},{"v":4.300000190734863,"d":"4.30"},{"v":20.200000762939453,"d":"20.20"},{"v":65.19999694824219,"d":"65.20"},{"v":0.30000001192092896,"d":"0.30"},{"v":3.5999999046325684,"d":"3.60"},{"v":8.5,"d":"8.50"},{"v":7.199999809265137,"d":"7.20"},{"v":4.199999809265137,"d":"4.20"},{"v":12.5,"d":"12.50"},0.01,{"v":10.418410041841005,"d":"10.42"},{"v":9.790794979079498,"d":"9.79"},{"v":8,"d":"8.00"},{"v":20,"d":"20.00"},{"v":15,"d":"15.00"},null,{"v":1.399999976158142,"d":"1.40"},{"v":0.7400000095367432,"d":"0.74"},{"v":0.6699999809265137,"d":"0.67"},{"v":0.5,"d":"0.50"},{"v":0.3,"d":"0.30"},{"v":0.8,"d":"0.80"},{"v":0.25999999046325684,"d":"0.26"},"Organic table"]
["Sunflower oil",null,"Oil",{"v":99.3,"d":"99.30"},{"v":0,"d":"0.00"},{"v":0,"d":"0.00"},{"v":99.5,"d":"99.50"},0.05,{"v":0,"d":"0.00"},{"v":0,"d":"0.00"},{"v":0,"d":"0.00"},{"v":0,"d":"0.00"},{"v":0,"d":"0.00"},{"v":0,"d":"0.00"},{"v":6.3,"d":"6.30"},{"v":4.3,"d":"4.30"},{"v":20.3,"d":"20.30"},{"v":64.9,"d":"64.90"},{"v":0.3,"d":"0.30"},{"v":0,"d":"0.00"},{"v":0,"d":"0.00"},{"v":0,"d":"0.00"},{"v":0,"d":"0.00"},{"v":0,"d":"0.00"},0.08,{"v":0,"d":"0.00"},{"v":37.40585774058577,"d":"37.41"},{"v":4,"d":"4.00"},{"v":4,"d":"4.00"},{"v":3,"d":"3.00"},null,null,{"v":0,"d":"0.00"},{"v":0,"d":"0.00"},{"v":0,"d":"0.00"},{"v":0,"d":"0.00"},{"v":0,"d":"0.00"},{"v":0,"d":"0.00"},"INRA feed table 2002"]
["Triticale 10,9% CP","Triticale 10,9% MAT","Cereals",{"v":87,"d":"87.00"},{"v":10.9,"d":"10.90"},{"v":2.9,"d":"2.90"},{"v":1.5,"d":"1.50"},{"v":1.7,"d":"1.70"},0.43,0.36,0.19,0.29,{"v":0.47000000000000003,"d":"0.47"},{"v":0.13999999999999999,"d":"0.14"},{"v":17,"d":"17.00"},{"v":0.9,"d":"0.90"},{"v":13.5,"d":"13.50"},{"v":60.8,"d":"60.80"},{"v":7.1,"d":"7.10"},{"v":0.6,"d":"0.60"},{"v":3.3,"d":"3.30"},{"v":2.5,"d":"2.50"},{"v":1.1,"d":"1.10"},{"v":5,"d":"5.00"},0.06,{"v":12.259414225941423,"d":"12.26"},{"v":11.715481171548117,"d":"11.72"},{"v":40,"d":"40.00"},{"v":40,"d":"40.00"},{"v":40,"d":"40.00"},null,{"v":2.2,"d":"2.20"},0.32,0.26,0.16,0.19,0.35,{"v":0.1,"d":"0.10"},"Organic table"]
["Triticale 7,9% CP","Triticale 7,9% MAT","Cereals",{"v":87,"d":"87.00"},{"v":7.9,"d":"7.90"},{"v":2.9,"d":"2.90"},{"v":1.5,"d":"1.50"},{"v":1.7,"d":"1.70"},0.31,0.26,{"v":0.13999999999999999,"d":"0.14"},{"v":0.21000000000000002,"d":"0.21"},{"v":0.33999999999999997,"d":"0.34"},{"v":0.1,"d":"0.10"},{"v":17,"d":"17.00"},{"v":0.9,"d":"0.90"},{"v":13.5,"d":"13.50"},{"v":60.8,"d":"60.80"},{"v":7.1,"d":"7.10"},{"v":0.6,"d":"0.60"},{"v":3.3,"d":"3.30"},{"v":2.5,"d":"2.50"},{"v":1.1,"d":"1.10"},{"v":5,"d":"5.00"},0.06,{"v":13.723849372384937,"d":"13.72"},{"v":13.472803347280335,"d":"13.47"},{"v":40,"d":"40.00"},{"v":40,"d":"40.00"},{"v":40,"d":"40.00"},null,{"v":2.2,"d":"2.20"},0.32,0.26,0.16,0.19,0.35,{"v":0.1,"d":"0.10"},"Organic table"]
["Triticale 8,9% CP","Triticale 8,9% MAT","Cereals",{"v":87,"d":"87.00"},{"v":8.9,"d":"8.90"},{"v":2.9,"d":"2.90"},{"v":1.5,"d":"1.50"},{"v":1.7,"d":"1.70"},0.35,{"v":0.3,"d":"0.30"},0.15,{"v":0.22999999999999998,"d":"0.23"},0.39,0.12,{"v":17,"d":"17.00"},{"v":0.9,"d":"0.90"},{"v":13.5,"d":"13.50"},{"v":60.8,"d":"60.80"},{"v":7.1,"d":"7.10"},{"v":0.6,"d":"0.60"},{"v":3.3,"d":"3.30"},{"v":2.5,"d":"2.50"},{"v":1.1,"d":"1.10"},{"v":5,"d":"5.00"},0.06,{"v":13.723849372384937,"d":"13.72"},{"v":13.472803347280335,"d":"13.47"},{"v":40,"d":"40.00"},{"v":40,"d":"40.00"},{"v":40,"d":"40.00"},null,{"v":2.2,"d":"2.20"},0.32,0.26,0.16,0.19,0.35,{"v":0.1,"d":"0.10"},"Organic table"]
["Triticale 9,9% CP","Triticale 9,9% MAT","Cereals",{"v":87,"d":"87.00"},{"v":9.9,"d":"9.90"},{"v":2.9,"d":"2.90"},{"v":1.5,"d":"1.50"},{"v":1.7,"d":"1.70"},0.39,{"v":0.32999999999999996,"d":"0.33"},{"v":0.16999999999999998,"d":"0.17"},0.26,0.43,0.13,{"v":17,"d":"17.00"},{"v":0.9,"d":"0.90"},{"v":13.5,"d":"13.50"},{"v":60.8,"d":"60.80"},{"v":7.1,"d":"7.10"},{"v":0.6,"d":"0.60"},{"v":3.3,"d":"3.30"},{"v":2.5,"d":"2.50"},{"v":1.1,"d":"1.10"},{"v":5,"d":"5.00"},0.06,{"v":12.259414225941423,"d":"12.26"},{"v":11.715481171548117,"d":"11.72"},{"v":40,"d":"40.00"},{"v":70,"d":"70.00"},{"v":40,"d":"40.00"},"*",{"v":2.2,"d":"2.20"},0.32,0.26,0.16,0.19,0.35,{"v":0.1,"d":"0.10"},"Organic table"]
["Vetch common",null,"Legume seeds",{"v":90.9000015258789,"d":"90.90"},{"v":27.200000762939453,"d":"27.20"},{"v":5.900000095367432,"d":"5.90"},{"v":1,"d":"1.00"},{"v":2.9000000953674316,"d":"2.90"},1.75,{"v":1.0199999809265137,"d":"1.02"},{"v":0.2200000047683716,"d":"0.22"},{"v":0.4400000095367432,"d":"0.44"},{"v":0.6599999904632569,"d":"0.66"},{"v":0.24000000953674316,"d":"0.24"},{"v":19.899999618530273,"d":"19.90"},{"v":4.800000190734863,"d":"4.80"},{"v":8.899999618530273,"d":"8.90"},{"v":61.5,"d":"61.50"},{"v":2.5999999046325684,"d":"2.60"},{"v":4.8,"d":"4.80"},{"v":4.3,"d":"4.30"},{"v":1.9,"d":"1.90"},{"v":1.4,"d":"1.40"},{"v":9.6,"d":"9.60"},{"v":0,"d":"0.00"},{"v":9.539748953974895,"d":"9.54"},{"v":9.288702928870293,"d":"9.29"},{"v":5,"d":"5.00"},{"v":5,"d":"5.00"},{"v":0,"d":"0.00"},null,null,{"v":0,"d":"0.00"},{"v":0,"d":"0.00"},{"v":0,"d":"0.00"},{"v":0,"d":"0.00"},{"v":0,"d":"0.00"},{"v":0,"d":"0.00"},"Organic table"]
["Vetch common leaves",null,"Dehydrated forage ",{"v":19.3,"d":"19.30"},{"v":23,"d":"23.00"},{"v":25.4,"d":"25.40"},{"v":2.5,"d":"2.50"},{"v":9.8,"d":"9.80"},0.53,0.58,0.09,{"v":0,"d":"0.00"},{"v":0,"d":"0.00"},{"v":0,"d":"0.00"},{"$nulls":5},{"v":12,"d":"12.00"},{"v":4.4,"d":"4.40"},{"$nulls":4},{"v":0,"d":"0.00"},{"v":0,"d":"0.00"},{"$nulls":11},"Feedipedia "]
["Wheat 10,5% CP","Blé tendre 10,5% MAT","Cereals",{"v":86.9,"d":"86.90"},{"v":10.9,"d":"10.90"},{"v":2.4,"d":"2.40"},{"v":1.4,"d":"1.40"},{"v":1.5,"d":"1.50"},0.31,{"v":0.32999999999999996,"d":"0.33"},0.18,0.25,{"v":0.42000000000000004,"d":"0.42"},0.13,{"v":1.8,"d":"1.80"},0.08,{"v":1.6,"d":"1.60"},{"v":5.8,"d":"5.80"},{"v":0.6,"d":"0.60"},{"v":0.6,"d":"0.60"},{"v":3.1,"d":"3.10"},{"v":2,"d":"2.00"},{"v":1,"d":"1.00"},{"v":4,"d":"4.00"},0.05,{"v":6.694560669456067,"d":"6.69"},{"v":6.610878661087866,"d":"6.61"},{"v":40,"d":"40.00"},{"v":70,"d":"70.00"},{"v":70,"d":"70.00"},{"v":1,"d":"1.00"},"*",0.26,0.27,0.16,{"v":0.21000000000000002,"d":"0.21"},0.36,{"v":0.11000000000000001,"d":"0.11"},"Organic table"]
["Wheat 11,5% CP","Blé tendre 11,5% MAT","Cereals",{"v":86.9,"d":"86.90"},{"v":11.5,"d":"11.50"},{"v":2.4,"d":"2.40"},{"v":1.4,"d":"1.40"},{"v":1.5,"d":"1.50"},{"v":0.33999999999999997,"d":"0.34"},0.36,{"v":0.2,"d":"0.20"},0.27,{"v":0.45999999999999996,"d":"0.46"},{"v":0.13999999999999999,"d":"0.14"},{"v":1.8,"d":"1.80"},0.08,{"v":1.6,"d":"1.60"},{"v":5.8,"d":"5.80"},{"v":0.6,"d":"0.60"},{"v":0.6,"d":"0.60"},{"v":3.1,"d":"3.10"},{"v":2,"d":"2.00"},{"v":1,"d":"1.00"},{"v":4,"d":"4.00"},0.05,{"v":6.694560669456067,"d":"6.69"},{"v":6.610878661087866,"d":"6.61"},{"v":40,"d":"40.00"},{"v":70,"d":"70.00"},{"v":70,"d":"70.00"},null,null,0.26,0.27,0.16,{"v":0.21000000000000002,"d":"0.21"},0.36,{"v":0.11000000000000001,"d":"0.11"},"Organic table"]
["Wheat 9,5% CP","Blé tendre 9,5% MAT","Cereals",{"v":86.9,"d":"86.90"},{"v":9.5,"d":"9.50"},{"v":2.4,"d":"2.40"},{"v":1.4,"d":"1.40"},{"v":1.5,"d":"1.50"},{"v":0.27999999999999997,"d":"0.28"},{"v":0.3,"d":"0.30"},0.16,{"v":0.22999999999999998,"d":"0.23"},0.38,0.12,{"v":1.8,"d":"1.80"},0.08,{"v":1.6,"d":"1.60"},{"v":5.8,"d":"5.80"},{"v":0.6,"d":"0.60"},{"v":0.6,"d":"0.60"},{"v":3.1,"d":"3.10"},{"v":2,"d":"2.00"},{"v":1,"d":"1.00"},{"v":4,"d":"4.00"},0.05,{"v":6.694560669456067,"d":"6.69"},{"v":6.610878661087866,"d":"6.61"},{"v":40,"d":"40.00"},{"v":70,"d":"70.00"},{"v":70,"d":"70.00"},null,null,0.26,0.27,0.16,{"v":0.21000000000000002,"d":"0.21"},0.36,{"v":0.11000000000000001,"d":"0.11"},"Organic table"]
["Wheat bran",null,"Wheat by-products",{"v":87.5,"d":"87.50"},{"v":10.5,"d":"10.50"},{"v":2.5999999046325684,"d":"2.60"},{"v":1.600000023841858,"d":"1.60"},{"v":1.600000023841858,"d":"1.60"},{"v":0.3099999904632568,"d":"0.31"},{"v":0.3200000047683716,"d":"0.32"},{"v":0.17000000476837157,"d":"0.17"},{"v":0.24000000953674316,"d":"0.24"},{"v":0.40999999046325686,"d":"0.41"},{"v":0.12999999523162842,"d":"0.13"},{"v":17.799999237060547,"d":"17.80"},{"v":0.800000011920929,"d":"0.80"},{"v":15.199999809265137,"d":"15.20"},{"v":56.400001525878906,"d":"56.40"},{"v":5.900000095367432,"d":"5.90"},{"v":0.6000000238418579,"d":"0.60"},{"v":3.200000047683716,"d":"3.20"},{"v":2.0999999046325684,"d":"2.10"},{"v":1,"d":"1.00"},{"v":4,"d":"4.00"},{"v":0.05000000074505806,"d":"0.05"},{"v":12.426778242677825,"d":"12.43"},{"v":11.92468619246862,"d":"11.92"},{"v":8,"d":"8.00"},{"v":8,"d":"8.00"},{"v":5,"d":"5.00"},{"v":55,"d":"55.00"},null,0.25,{"v":0.25999999046325684,"d":"0.26"},0.15,{"v":0.2,"d":"0.20"},0.35,{"v":0.1100000023841858,"d":"0.11"},"Organic table"]
["Wheat middlings, all types except durum",null,"Wheat by-products",{"v":86.5999984741211,"d":"86.60"},{"v":15.199999809265137,"d":"15.20"},{"v":6.599999904632568,"d":"6.60"},{"v":3.9000000953674316,"d":"3.90"},{"v":4.400000095367432,"d":"4.40"},{"v":0.6,"d":"0.60"},{"v":0.49000000953674316,"d":"0.49"},{"v":0.22999999523162842,"d":"0.23"},{"v":0.3099999904632568,"d":"0.31"},{"v":0.5400000095367432,"d":"0.54"},{"v":0.2,"d":"0.20"},{"v":17.799999237060547,"d":"17.80"},{"v":0.800000011920929,"d":"0.80"},{"v":15.199999809265137,"d":"15.20"},{"v":56.400001525878906,"d":"56.40"},{"v":5.900000095367432,"d":"5.90"},{"v":1.100000023841858,"d":"1.10"},{"v":8.800000190734863,"d":"8.80"},{"v":7,"d":"7.00"},{"v":3.5,"d":"3.50"},{"v":10.899999618530273,"d":"10.90"},{"v":0.05000000074505806,"d":"0.05"},{"v":8.744769874476987,"d":"8.74"},{"v":8.368200836820083,"d":"8.37"},{"$nulls":5},{"v":0.4699999809265137,"d":"0.47"},{"v":0.3599999904632568,"d":"0.36"},{"v":0.1899999976158142,"d":"0.19"},{"v":0.24000000953674316,"d":"0.24"},{"v":0.43000001907348634,"d":"0.43"},{"v":0.1600000023841858,"d":"0.16"},"Organic table"]
["Whey dreid (Full fat)",null,"Dairy productcts",{"v":96.2,"d":"96.20"},{"v":13.3,"d":"13.30"},{"v":0,"d":"0.00"},{"v":18.8,"d":"18.80"},{"v":8.2,"d":"8.20"},0.99,0.75,{"v":0.2,"d":"0.20"},0.24,{"v":0.44000000000000006,"d":"0.44"},0.19,{"v":52.4,"d":"52.40"},{"v":22.9,"d":"22.90"},{"v":38.8,"d":"38.80"},{"v":72,"d":"72.00"},{"v":1.8,"d":"1.80"},{"v":8.1,"d":"8.10"},{"v":7,"d":"7.00"},null,null,{"v":20.6,"d":"20.60"},6.32,{"v":12.761506276150628,"d":"12.76"},{"v":12.761506276150628,"d":"12.76"},{"v":10,"d":"10.00"},{"v":10,"d":"10.00"},{"v":10,"d":"10.00"},null,null,0.93,0.66,{"v":0.2,"d":"0.20"},{"v":0.2,"d":"0.20"},{"v":0.4,"d":"0.40"},0.17,"INRA feed table 2002"]
["Whey dried (low fat)",null,"Dairy productcts",{"v":95.7,"d":"95.70"},{"v":14.4,"d":"14.40"},{"v":0,"d":"0.00"},{"v":9.9,"d":"9.90"},{"v":8.5,"d":"8.50"},{"v":1.0699999999999998,"d":"1.07"},0.82,{"v":0.22000000000000003,"d":"0.22"},0.26,0.48,{"v":0.2,"d":"0.20"},{"v":27.7,"d":"27.70"},{"v":12.1,"d":"12.10"},{"v":20.5,"d":"20.50"},{"v":3.8,"d":"3.80"},{"v":0.9,"d":"0.90"},{"v":8.8,"d":"8.80"},{"v":7.2,"d":"7.20"},null,null,{"v":20.7,"d":"20.70"},6.42,{"v":10.585774058577407,"d":"10.59"},{"v":10.585774058577407,"d":"10.59"},{"v":10,"d":"10.00"},{"v":10,"d":"10.00"},{"v":10,"d":"10.00"},null,null,1.01,0.72,0.22,0.22,0.44,0.18,"INRA feed table 2002"]
["Whey, acid or sweet, dehydrated",null,"Dairy productcts",{"v":96.69999694824219,"d":"96.70"},{"v":11.800000190734863,"d":"11.80"},{"v":0,"d":"0.00"},{"v":2.5,"d":"2.50"},{"v":8,"d":"8.00"},{"v":0.8800000190734864,"d":"0.88"},{"v":0.6599999904632569,"d":"0.66"},{"v":0.1799999952316284,"d":"0.18"},{"v":0.20999999046325685,"d":"0.21"},{"v":0.3900000095367432,"d":"0.39"},{"v":0.1600000023841858,"d":"0.16"},{"v":29.299999237060547,"d":"29.30"},{"v":12.800000190734863,"d":"12.80"},{"v":21.700000762939453,"d":"21.70"},{"v":4,"d":"4.00"},{"v":1,"d":"1.00"},{"v":7.699999809265137,"d":"7.70"},{"v":6.800000190734863,"d":"6.80"},{"v":0,"d":"0.00"},{"v":1.5,"d":"1.50"},{"v":20.700000762939453,"d":"20.70"},{"v":6.309999942779541,"d":"6.31"},{"v":8.661087866108787,"d":"8.66"},{"v":8.661087866108787,"d":"8.66"},{"$nulls":5},{"v":0.8300000190734863,"d":"0.83"},{"v":0.5800000190734863,"d":"0.58"},{"v":0.17000000476837157,"d":"0.17"},{"v":0.1799999952316284,"d":"0.18"},0.35,0.15,"Organic table"]
["White Lupine",null,"Legume seeds",{"v":87.5,"d":"87.50"},{"v":32.900001525878906,"d":"32.90"},{"v":11.800000190734863,"d":"11.80"},{"v":6.699999809265137,"d":"6.70"},{"v":3.4000000953674316,"d":"3.40"},{"v":1.6100000381469726,"d":"1.61"},{"v":1.2300000190734863,"d":"1.23"},{"v":0.25999999046325684,"d":"0.26"},0.55,{"v":0.8100000381469726,"d":"0.81"},{"v":0.22999999523162842,"d":"0.23"},{"v":7.400000095367432,"d":"7.40"},{"v":2,"d":"2.00"},{"v":49.099998474121094,"d":"49.10"},{"v":14.699999809265137,"d":"14.70"},{"v":8.300000190734863,"d":"8.30"},{"v":2.5999999046325684,"d":"2.60"},{"v":3.5999999046325684,"d":"3.60"},{"v":2.200000047683716,"d":"2.20"},{"v":1.399999976158142,"d":"1.40"},{"v":9.7,"d":"9.70"},0.29,{"v":9.581589958158995,"d":"9.58"},{"v":9.372384937238493,"d":"9.37"},{"v":10,"d":"10.00"},{"v":15,"d":"15.00"},{"v":5,"d":"5.00"},"*",{"v":0.8999999761581421,"d":"0.90"},{"v":1.4,"d":"1.40"},{"v":1,"d":"1.00"},{"v":0.20999999046325685,"d":"0.21"},{"v":0.4400000095367432,"d":"0.44"},{"v":0.6599999904632569,"d":"0.66"},{"v":0.1899999976158142,"d":"0.19"},"Organic table"]
["Yeast dried",null,"Other plant product ",{"v":93.3,"d":"93.30"},{"v":46.5,"d":"46.50"},{"v":1.8,"d":"1.80"},{"v":3.6,"d":"3.60"},{"v":7.1,"d":"7.10"},{"v":0.6900000000000001,"d":"0.69"},0.39,0.15,{"v":0.32999999999999996,"d":"0.33"},0.48,{"v":0.049,"d":"0.05"},{"$nulls":5},{"v":0.3,"d":"0.30"},{"v":13.1,"d":"13.10"},null,{"v":2.4,"d":"2.40"},null,{"v":1.8,"d":"1.80"},{"v":9.297071129707113,"d":"9.30"},{"v":0,"d":"0.00"},{"v":10,"d":"10.00"},{"v":10,"d":"10.00"},{"$nulls":9},"French table and Feedipedia"]

{"sheet":"Poultry_Needs","index":3,"n_rows":150,"n_cols":44,"rows_kept":150}
["Obj_reference","Scenarios_reference","Production","Scenarios ","Nb phasis","Formula_Name","Duration","Country","Type of animals to select ration limitation levels","F1_ME Min","F1_CP Min","F1_FAT Min","F1_CF Min","F1_Ca Min","F1_P Min","F1_Na Min","F1 Lys tot min","F1_Lys DIS min","F1_Met tot Max","F1_Met DIS Min","F1_Met+Cys Tot Min","F1_Met+Cys DIS Min","F1_Thr tot Min","F1_Thr DIS Min","F1_try tot Min","F1_try DIS Min","F1_ME Max","F1_CP Max","F1_FAT Max","F1_CF Max","F1_Ca Max","F1_P Max","F1_Na Max","F1_Lys Tot Max ","F1_Lys DIS Max","F1_Met Tot Max2","F1_Met DIS Max","F1_Met+Cys Tot max","F1_Met+Cys DIS Max","F1_Thr tot Max","F1_Thr Max","F1_try tot Max","F1_try DIS Max","Comments "]
[{"$f":"Requirment[[#This Row],[Production]]&\"_\"&Requirment[[#This Row],[Scenarios ]]&\"_\"&Requirment[[#This Row],[Nb phasis]]&\"_\"&Requirment[[#This Row],[Formula_Name]]","v":"Broiler_2.4 Kg alive 63 days_3_Finishing"},{"$f":"Requirment[[#This Row],[Production]]&\"_\"&Requirment[[#This Row],[Scenarios ]]&\"_\"&Requirment[[#This Row],[Nb phasis]]","v":"Broiler_2.4 Kg alive 63 days_3"},"Broiler","2.4 Kg alive 63 days",3,"Finishing","29 - 63 days","Germany","broiler",11.9,17,4,2,0.7,0.5,0.1,{"v":0.7,"d":"0.70"},{"v":0.6306299999999999,"d":"0.63"},{"v":0.3,"d":"0.30"},{"v":0.27026999999999995,"d":"0.27"},{"v":0.5249999999999999,"d":"0.53"},{"v":0.4729724999999999,"d":"0.47"},{"v":0.48999999999999994,"d":"0.49"},{"v":0.4414409999999999,"d":"0.44"},{"v":0.119,"d":"0.12"},{"v":0.1072071,"d":"0.11"},{"v":0.049372384937238493,"d":"0.05"},17,8,2,0.7,0.5,0.1,{"v":0.7,"d":"0.70"},{"v":0.6306299999999999,"d":"0.63"},{"v":0.3,"d":"0.30"},{"v":0.27026999999999995,"d":"0.27"},{"v":0.5249999999999999,"d":"0.53"},{"v":0.4729724999999999,"d":"0.47"},{"v":0.48999999999999994,"d":"0.49"},{"v":0.4414409999999999,"d":"0.44"},{"v":0.119,"d":"0.12"},{"v":0.1072071,"d":"0.11"}]
[{"$f":"Requirment[[#This Row],[Production]]&\"_\"&Requirment[[#This Row],[Scenarios ]]&\"_\"&Requirment[[#This Row],[Nb phasis]]&\"_\"&Requirment[[#This Row],[Formula_Name]]","v":"Broiler_2.4 Kg alive 63 days_3_Growing"},{"$f":"Requirment[[#This Row],[Production]]&\"_\"&Requirment[[#This Row],[Scenarios ]]&\"_\"&Requirment[[#This Row],[Nb phasis]]","v":"Broiler_2.4 Kg alive 63 days_3"},"Broiler","2.4 Kg alive 63 days",3,"Growing","15-28 days","Germany","< 28 day broiler",11.9,19,4,2,0.9,0.7,0.2,{"v":0.9,"d":"0.90"},0.81,{"v":0.3,"d":"0.30"},{"v":0.26999999999999996,"d":"0.27"},{"v":0.68103,"d":"0.68"},{"v":0.6129270000000001,"d":"0.61"},{"v":0.60813,"d":"0.61"},{"v":0.547317,"d":"0.55"},{"v":0.162,"d":"0.16"},{"v":0.1458,"d":"0.15"},11.9,19,8,2,0.9,0.7,0.2,{"v":0.9,"d":"0.90"},0.81,{"v":0.3,"d":"0.30"},{"v":0.26999999999999996,"d":"0.27"},{"v":0.68103,"d":"0.68"},{"v":0.6129270000000001,"d":"0.61"},{"v":0.60813,"d":"0.61"},{"v":0.547317,"d":"0.55"},{"v":0.162,"d":"0.16"},{"v":0.1458,"d":"0.15"}]
[{"$f":"Requirment[[#This Row],[Production]]&\"_\"&Requirment[[#This Row],[Scenarios ]]&\"_\"&Requirment[[#This Row],[Nb phasis]]&\"_\"&Requirment[[#This Row],[Formula_Name]]","v":"Broiler_2.4 Kg alive 63 days_3_Starter"},{"$f":"Requirment[[#This Row],[Production]]&\"_\"&Requirment[[#This Row],[Scenarios ]]&\"_\"&Requirment[[#This Row],[Nb phasis]]","v":"Broiler_2.4 Kg alive 63 days_3"},"Broiler","2.4 Kg alive 63 days",3,"Starter","0-14","Germany","< 28 day broiler",11.9,21,4,2,0.9,0.7,0.2,{"v":1,"d":"1.00"},{"v":0.9037000000000001,"d":"0.90"},{"v":0.3,"d":"0.30"},{"v":0.27111,"d":"0.27"},{"v":0.7555999999999999,"d":"0.76"},{"v":0.68283572,"d":"0.68"},{"v":0.6667000000000001,"d":"0.67"},{"v":0.6024967900000001,"d":"0.60"},{"v":0.16670000000000001,"d":"0.17"},{"v":0.15064679000000003,"d":"0.15"},11.9,21,4,2,0.9,0.7,0.2,{"v":1,"d":"1.00"},{"v":0.9037000000000001,"d":"0.90"},{"v":0.3,"d":"0.30"},{"v":0.27111,"d":"0.27"},{"v":0.7555999999999999,"d":"0.76"},{"v":0.68283572,"d":"0.68"},{"v":0.6667000000000001,"d":"0.67"},{"v":0.6024967900000001,"d":"0.60"},{"v":0.16670000000000001,"d":"0.17"},{"v":0.15064679000000003,"d":"0.15"}]
[{"$f":"Requirment[[#This Row],[Production]]&\"_\"&Requirment[[#This Row],[Scenarios ]]&\"_\"&Requirment[[#This Row],[Nb phasis]]&\"_\"&Requirment[[#This Row],[Formula_Name]]","v":"Broiler_2.6 kg alive at 112 days_2 feeds_3_Finishing"},{"$f":"Requirment[[#This Row],[Production]]&\"_\"&Requirment[[#This Row],[Scenarios ]]&\"_\"&Requirment[[#This Row],[Nb phasis]]","v":"Broiler_2.6 kg alive at 112 days_2 feeds_3"},"Broiler","2.6 kg alive at 112 days_2 feeds",3,"Finishing","63-112 days","France","broiler",{"v":11.297071129707113,"d":"11.3"},14,2,0,0.7,0.3,0.15,{"v":0.7215007215007214,"d":"0.72"},0.65,{"v":0.27750027750027745,"d":"0.28"},0.25,{"v":0.5439005439005439,"d":"0.54"},0.49,{"v":0.5439005439005439,"d":"0.54"},0.49,{"v":0.1332001332001332,"d":"0.13"},0.12,{"v":11.715481171548117,"d":"11.7"},16,7,7,0.8,0.35,0.18,{"v":0.8325008325008325,"d":"0.83"},0.75,{"v":0.3885003885003885,"d":"0.39"},0.35,{"v":0.6549006549006549,"d":"0.65"},0.59,{"v":0.7659007659007658,"d":"0.77"},0.69,{"v":0.3552003552003552,"d":"0.36"},0.32]
[{"$f":"Requirment[[#This Row],[Production]]&\"_\"&Requirment[[#This Row],[Scenarios ]]&\"_\"&Requirment[[#This Row],[Nb phasis]]&\"_\"&Requirment[[#This Row],[Formula_Name]]","v":"Broiler_2.6 kg alive at 112 days_2 feeds_3_Growing"},{"$f":"Requirment[[#This Row],[Production]]&\"_\"&Requirment[[#This Row],[Scenarios ]]&\"_\"&Requirment[[#This Row],[Nb phasis]]","v":"Broiler_2.6 kg alive at 112 days_2 feeds_3"},"Broiler","2.6 kg alive at 112 days_2 feeds",3,"Growing","28-63 day","France","broiler",{"v":11.715481171548117,"d":"11.7"},17,2,0,0.9,0.4,0.15,{"v":0.8222222222222222,"d":"0.82"},0.74,{"v":0.3333333333333333,"d":"0.33"},0.3,{"v":0.6222222222222222,"d":"0.62"},0.56,{"v":0.5555555555555555,"d":"0.56"},0.5,{"v":0.17777777777777778,"d":"0.18"},0.16,{"v":12.133891213389122,"d":"12.1"},19,7,7,1,0.45,0.18,{"v":0.9333333333333333,"d":"0.93"},0.84,{"v":0.4444444444444445,"d":"0.44"},{"v":0.4,"d":"0.40"},{"v":0.7333333333333334,"d":"0.73"},0.66,{"v":0.7777777777777777,"d":"0.78"},{"v":0.7,"d":"0.70"},{"v":0.39999999999999997,"d":"0.40"},0.36]
[{"$f":"Requirment[[#This Row],[Production]]&\"_\"&Requirment[[#This Row],[Scenarios ]]&\"_\"&Requirment[[#This Row],[Nb phasis]]&\"_\"&Requirment[[#This Row],[Formula_Name]]","v":"Broiler_2.6 kg alive at 112 days_2 feeds_3_Starter"},{"$f":"Requirment[[#This Row],[Production]]&\"_\"&Requirment[[#This Row],[Scenarios ]]&\"_\"&Requirment[[#This Row],[Nb phasis]]","v":"Broiler_2.6 kg alive at 112 days_2 feeds_3"},"Broiler","2.6 kg alive at 112 days_2 feeds",3,"Starter","0-28 day","France","< 28 day broiler",{"v":11.506276150627615,"d":"11.5"},19,2.2,0,1.05,0.4,0.15,{"v":0.9959057209250857,"d":"1.00"},0.9,{"v":0.38729666924864437,"d":"0.39"},0.35,{"v":0.7524621002545091,"d":"0.75"},0.68,{"v":0.6639371472833904,"d":"0.66"},0.6,{"v":0.1659842868208476,"d":"0.17"},0.15,{"v":12.133891213389122,"d":"12.1"},21,5.5,5,1.15,0.45,0.18,{"v":1.106561912138984,"d":"1.11"},1,{"v":0.49795286046254283,"d":"0.50"},0.45,{"v":0.8631182914684076,"d":"0.86"},0.78,{"v":0.8852495297111873,"d":"0.89"},{"v":0.8,"d":"0.80"},{"v":0.38729666924864437,"d":"0.39"},0.35]
[{"$f":"Requirment[[#This Row],[Production]]&\"_\"&Requirment[[#This Row],[Scenarios ]]&\"_\"&Requirment[[#This Row],[Nb phasis]]&\"_\"&Requirment[[#This Row],[Formula_Name]]","v":"Broiler_2.6 kg alive at 126 days_3 feeds_3_Finishing"},{"$f":"Requirment[[#This Row],[Production]]&\"_\"&Requirment[[#This Row],[Scenarios ]]&\"_\"&Requirment[[#This Row],[Nb phasis]]","v":"Broiler_2.6 kg alive at 126 days_3 feeds_3"},"Broiler","2.6 kg alive at 126 days_3 feeds",3,"Finishing","63-126 days","France","broiler",{"v":10.878661087866108,"d":"10.9"},14,2,0,0.7,0.3,0.15,{"v":0.6882006882006881,"d":"0.69"},0.62,{"v":0.2553002553002553,"d":"0.26"},0.23,{"v":0.5217005217005216,"d":"0.52"},0.47,{"v":0.4884004884004884,"d":"0.49"},0.44,{"v":0.1221001221001221,"d":"0.12"},0.11,{"v":11.715481171548117,"d":"11.7"},16,7,7,0.8,0.35,0.18,{"v":0.7992007992007991,"d":"0.80"},0.72,{"v":0.3663003663003663,"d":"0.37"},0.33,{"v":0.6327006327006326,"d":"0.63"},0.57,{"v":0.7104007104007104,"d":"0.71"},0.64,{"v":0.34410034410034407,"d":"0.34"},0.31]
[{"$f":"Requirment[[#This Row],[Production]]&\"_\"&Requirment[[#This Row],[Scenarios ]]&\"_\"&Requirment[[#This Row],[Nb phasis]]&\"_\"&Requirment[[#This Row],[Formula_Name]]","v":"Broiler_2.6 kg alive at 126 days_3 feeds_3_Growing"},{"$f":"Requirment[[#This Row],[Production]]&\"_\"&Requirment[[#This Row],[Scenarios ]]&\"_\"&Requirment[[#This Row],[Nb phasis]]","v":"Broiler_2.6 kg alive at 126 days_3 feeds_3"},"Broiler","2.6 kg alive at 126 days_3 feeds",3,"Growing","28-63 days","France","broiler",{"v":11.715481171548117,"d":"11.7"},17,2,0,0.9,0.4,0.15,{"v":0.8222222222222222,"d":"0.82"},0.74,{"v":0.3333333333333333,"d":"0.33"},0.3,{"v":0.6222222222222222,"d":"0.62"},0.56,{"v":0.5555555555555555,"d":"0.56"},0.5,{"v":0.17777777777777778,"d":"0.18"},0.16,{"v":12.133891213389122,"d":"12.1"},19,7,7,1,0.45,0.18,{"v":0.9333333333333333,"d":"0.93"},0.84,{"v":0.4444444444444445,"d":"0.44"},{"v":0.4,"d":"0.40"},{"v":0.7333333333333334,"d":"0.73"},0.66,{"v":0.7777777777777777,"d":"0.78"},{"v":0.7,"d":"0.70"},{"v":0.39999999999999997,"d":"0.40"},0.36]
[{"$f":"Requirment[[#This Row],[Production]]&\"_\"&Requirment[[#This Row],[Scenarios ]]&\"_\"&Requirment[[#This Row],[Nb phasis]]&\"_\"&Requirment[[#This Row],[Formula_Name]]","v":"Broiler_2.6 kg alive at 126 days_3 feeds_3_Starter"},{"$f":"Requirment[[#This Row],[Production]]&\"_\"&Requirment[[#This Row],[Scenarios ]]&\"_\"&Requirment[[#This Row],[Nb phasis]]","v":"Broiler_2.6 kg alive at 126 days_3 feeds_3"},"Broiler","2.6 kg alive at 126 days_3 feeds",3,"Starter","0-28 days","France","< 28 day broiler",{"v":11.506276150627615,"d":"11.5"},19,2.2,0,1.05,0.4,0.15,{"v":0.9959057209250857,"d":"1.00"},0.9,{"v":0.38729666924864437,"d":"0.39"},0.35,{"v":0.7524621002545091,"d":"0.75"},0.68,{"v":0.6639371472833904,"d":"0.66"},0.6,{"v":0.1659842868208476,"d":"0.17"},0.15,{"v":12.133891213389122,"d":"12.1"},21,5.5,5,1.15,0.45,0.18,{"v":1.106561912138984,"d":"1.11"},1,{"v":0.49795286046254283,"d":"0.50"},0.45,{"v":0.8631182914684076,"d":"0.86"},0.78,{"v":0.8852495297111873,"d":"0.89"},{"v":0.8,"d":"0.80"},{"v":0.38729666924864437,"d":"0.39"},0.35]
[{"$f":"Requirment[[#This Row],[Production]]&\"_\"&Requirment[[#This Row],[Scenarios ]]&\"_\"&Requirment[[#This Row],[Nb phasis]]&\"_\"&Requirment[[#This Row],[Formula_Name]]","v":"Broiler_2.6 kg alive at 126 days_4 feeds_4_Finishing 1"},{"$f":"Requirment[[#This Row],[Production]]&\"_\"&Requirment[[#This Row],[Scenarios ]]&\"_\"&Requirment[[#This Row],[Nb phasis]]","v":"Broiler_2.6 kg alive at 126 days_4 feeds_4"},"Broiler","2.6 kg alive at 126 days_4 feeds",4,"Finishing 1","63-98 days","France","broiler",{"v":11.297071129707113,"d":"11.3"},14,2,0,0.7,0.3,0.15,{"v":0.7215007215007214,"d":"0.72"},0.65,{"v":0.27750027750027745,"d":"0.28"},0.25,{"v":0.5439005439005439,"d":"0.54"},0.49,{"v":0.5439005439005439,"d":"0.54"},0.49,{"v":0.1332001332001332,"d":"0.13"},0.12,{"v":11.715481171548117,"d":"11.7"},16,7,7,0.8,0.35,0.18,{"v":0.8325008325008325,"d":"0.83"},0.75,{"v":0.3885003885003885,"d":"0.39"},0.35,{"v":0.6549006549006549,"d":"0.65"},0.59,{"v":0.7659007659007658,"d":"0.77"},0.69,{"v":0.3552003552003552,"d":"0.36"},0.32]
[{"$f":"Requirment[[#This Row],[Production]]&\"_\"&Requirment[[#This Row],[Scenarios ]]&\"_\"&Requirment[[#This Row],[Nb phasis]]&\"_\"&Requirment[[#This Row],[Formula_Name]]","v":"Broiler_2.6 kg alive at 126 days_4 feeds_4_Finishing 2"},{"$f":"Requirment[[#This Row],[Production]]&\"_\"&Requirment[[#This Row],[Scenarios ]]&\"_\"&Requirment[[#This Row],[Nb phasis]]","v":"Broiler_2.6 kg alive at 126 days_4 feeds_4"},"Broiler","2.6 kg alive at 126 days_4 feeds",4,"Finishing 2","98 - 126 jours","France","broiler",{"v":10.460251046025105,"d":"10.5"},14,2,0,0.7,0.3,0.15,{"v":0.666000666000666,"d":"0.67"},0.6,{"v":0.24420024420024422,"d":"0.24"},0.22,{"v":0.49950049950049946,"d":"0.50"},0.45,{"v":0.4329004329004329,"d":"0.43"},0.39,{"v":0.11100011100011101,"d":"0.11"},0.1,{"v":11.715481171548117,"d":"11.7"},16,7,8,0.8,0.35,0.18,{"v":0.777000777000777,"d":"0.78"},0.7,{"v":0.3552003552003552,"d":"0.36"},0.32,{"v":0.6105006105006106,"d":"0.61"},0.55,{"v":0.6549006549006549,"d":"0.65"},0.59,{"v":0.22200022200022201,"d":"0.22"},{"v":0.2,"d":"0.20"}]
[{"$f":"Requirment[[#This Row],[Production]]&\"_\"&Requirment[[#This Row],[Scenarios ]]&\"_\"&Requirment[[#This Row],[Nb phasis]]&\"_\"&Requirment[[#This Row],[Formula_Name]]","v":"Broiler_2.6 kg alive at 126 days_4 feeds_4_Growing"},{"$f":"Requirment[[#This Row],[Production]]&\"_\"&Requirment[[#This Row],[Scenarios ]]&\"_\"&Requirment[[#This Row],[Nb phasis]]","v":"Broiler_2.6 kg alive at 126 days_4 feeds_4"},"Broiler","2.6 kg alive at 126 days_4 feeds",4,"Growing","28-63 days","France","broiler",{"v":11.715481171548117,"d":"11.7"},17,2,0,0.9,0.4,0.15,{"v":0.8222222222222222,"d":"0.82"},0.74,{"v":0.3333333333333333,"d":"0.33"},0.3,{"v":0.6222222222222222,"d":"0.62"},0.56,{"v":0.5555555555555555,"d":"0.56"},0.5,{"v":0.17777777777777778,"d":"0.18"},0.16,{"v":12.133891213389122,"d":"12.1"},19,7,7,1,0.45,0.18,{"v":0.9333333333333333,"d":"0.93"},0.84,{"v":0.4444444444444445,"d":"0.44"},{"v":0.4,"d":"0.40"},{"v":0.7333333333333334,"d":"0.73"},0.66,{"v":0.7777777777777777,"d":"0.78"},{"v":0.7,"d":"0.70"},{"v":0.39999999999999997,"d":"0.40"},0.36]
[{"$f":"Requirment[[#This Row],[Production]]&\"_\"&Requirment[[#This Row],[Scenarios ]]&\"_\"&Requirment[[#This Row],[Nb phasis]]&\"_\"&Requirment[[#This Row],[Formula_Name]]","v":"Broiler_2.6 kg alive at 126 days_4 feeds_4_Starter"},{"$f":"Requirment[[#This Row],[Production]]&\"_\"&Requirment[[#This Row],[Scenarios ]]&\"_\"&Requirment[[#This Row],[Nb phasis]]","v":"Broiler_2.6 kg alive at 126 days_4 feeds_4"},"Broiler","2.6 kg alive at 126 days_4 feeds",4,"Starter","0-28 days","France","< 28 day broiler",{"v":11.506276150627615,"d":"11.5"},19,2.2,0,1.05,0.4,0.15,{"v":0.9959057209250857,"d":"1.00"},0.9,{"v":0.38729666924864437,"d":"0.39"},0.35,{"v":0.7524621002545091,"d":"0.75"},0.68,{"v":0.6639371472833904,"d":"0.66"},0.6,{"v":0.1659842868208476,"d":"0.17"},0.15,{"v":12.133891213389122,"d":"12.1"},21,5.5,5,1.15,0.45,0.18,{"v":1.106561912138984,"d":"1.11"},1,{"v":0.49795286046254283,"d":"0.50"},0.45,{"v":0.8631182914684076,"d":"0.86"},0.78,{"v":0.8852495297111873,"d":"0.89"},{"v":0.8,"d":"0.80"},{"v":0.38729666924864437,"d":"0.39"},0.35]
[{"$f":"Requirment[[#This Row],[Production]]&\"_\"&Requirment[[#This Row],[Scenarios ]]&\"_\"&Requirment[[#This Row],[Nb phasis]]&\"_\"&Requirment[[#This Row],[Formula_Name]]","v":"Broiler_2.6 kg alive at 98 days_2 feeds_2_Single feed"},{"$f":"Requirment[[#This Row],[Production]]&\"_\"&Requirment[[#This Row],[Scenarios ]]&\"_\"&Requirment[[#This Row],[Nb phasis]]","v":"Broiler_2.6 kg alive at 98 days_2 feeds_2"},"Broiler","2.6 kg alive at 98 days_2 feeds",2,"Single feed","28-98 day","France","broiler",{"v":11.715481171548117,"d":"11.7"},17,2,0,0.9,0.4,0.15,{"v":0.8222222222222222,"d":"0.82"},0.74,{"v":0.3333333333333333,"d":"0.33"},0.3,{"v":0.6222222222222222,"d":"0.62"},0.56,{"v":0.5555555555555555,"d":"0.56"},0.5,{"v":0.17777777777777778,"d":"0.18"},0.16,{"v":12.133891213389122,"d":"12.1"},19,7,7,1,0.45,0.18,{"v":1.106561912138984,"d":"1.11"},0.84,{"v":0.5269342438757068,"d":"0.53"},{"v":0.4,"d":"0.40"},{"v":0.8694415023949161,"d":"0.87"},0.66,{"v":0.9221349267824867,"d":"0.92"},{"v":0.7,"d":"0.70"},{"v":0.474240819488136,"d":"0.47"},0.36]
[{"$f":"Requirment[[#This Row],[Production]]&\"_\"&Requirment[[#This Row],[Scenarios ]]&\"_\"&Requirment[[#This Row],[Nb phasis]]&\"_\"&Requirment[[#This Row],[Formula_Name]]","v":"Broiler_2.6 kg alive at 98 days_2 feeds_2_Starter"},{"$f":"Requirment[[#This Row],[Production]]&\"_\"&Requirment[[#This Row],[Scenarios ]]&\"_\"&Requirment[[#This Row],[Nb phasis]]","v":"Broiler_2.6 kg alive at 98 days_2 feeds_2"},"Broiler","2.6 kg alive at 98 days_2 feeds",2,"Starter","0-28 day","France","< 28 day broiler",{"v":11.506276150627615,"d":"11.5"},19,2.2,0,1.05,0.4,0.15,{"v":0.9959057209250857,"d":"1.00"},0.9,{"v":0.38729666924864437,"d":"0.39"},0.35,{"v":0.7524621002545091,"d":"0.75"},0.68,{"v":0.6639371472833904,"d":"0.66"},0.6,{"v":0.1659842868208476,"d":"0.17"},0.15,{"v":12.133891213389122,"d":"12.1"},21,5.5,5,1.15,0.45,0.18,{"v":1.106561912138984,"d":"1.11"},1,{"v":0.49795286046254283,"d":"0.50"},0.45,{"v":0.8631182914684076,"d":"0.86"},0.78,{"v":0.8852495297111873,"d":"0.89"},{"v":0.8,"d":"0.80"},{"v":0.38729666924864437,"d":"0.39"},0.35]
[{"$f":"Requirment[[#This Row],[Production]]&\"_\"&Requirment[[#This Row],[Scenarios ]]&\"_\"&Requirment[[#This Row],[Nb phasis]]&\"_\"&Requirment[[#This Row],[Formula_Name]]","v":"Broiler_2.6 kg alive at 98 days_3 feeds_3_Finishing"},{"$f":"Requirment[[#This Row],[Production]]&\"_\"&Requirment[[#This Row],[Scenarios ]]&\"_\"&Requirment[[#This Row],[Nb phasis]]","v":"Broiler_2.6 kg alive at 98 days_3 feeds_3"},"Broiler","2.6 kg alive at 98 days_3 feeds",3,"Finishing","63-98 day","France","broiler",{"v":11.92468619246862,"d":"11.9"},15,2,0,0.7,0.3,0.15,{"v":0.7215007215007214,"d":"0.72"},0.65,{"v":0.3108003108003108,"d":"0.31"},0.28,{"v":0.5772005772005772,"d":"0.58"},0.52,{"v":0.45510045510045505,"d":"0.46"},0.41,{"v":0.1554001554001554,"d":"0.16"},0.14,{"v":12.343096234309623,"d":"12.3"},17,7,7,0.9,0.35,0.18,{"v":0.8325008325008325,"d":"0.83"},0.75,{"v":0.4218004218004218,"d":"0.42"},0.38,{"v":0.6882006882006882,"d":"0.69"},0.62,{"v":0.6771006771006771,"d":"0.68"},0.61,{"v":0.3774003774003774,"d":"0.38"},0.34]
[{"$f":"Requirment[[#This Row],[Production]]&\"_\"&Requirment[[#This Row],[Scenarios ]]&\"_\"&Requirment[[#This Row],[Nb phasis]]&\"_\"&Requirment[[#This Row],[Formula_Name]]","v":"Broiler_2.6 kg alive at 98 days_3 feeds_3_Growing"},{"$f":"Requirment[[#This Row],[Production]]&\"_\"&Requirment[[#This Row],[Scenarios ]]&\"_\"&Requirment[[#This Row],[Nb phasis]]","v":"Broiler_2.6 kg alive at 98 days_3 feeds_3"},"Broiler","2.6 kg alive at 98 days_3 feeds",3,"Growing","28-63 day","France","broiler",{"v":11.715481171548117,"d":"11.7"},17,2,0,0.9,0.4,0.15,{"v":0.9111111111111111,"d":"0.91"},0.82,{"v":0.35555555555555557,"d":"0.36"},0.32,{"v":0.6666666666666666,"d":"0.67"},0.6,{"v":0.6,"d":"0.60"},0.54,{"v":0.19999999999999998,"d":"0.20"},0.18,{"v":12.133891213389122,"d":"12.1"},19,7,7,1,0.45,0.18,{"v":1.0222222222222221,"d":"1.02"},0.92,{"v":0.4666666666666666,"d":"0.47"},0.42,{"v":0.7777777777777777,"d":"0.78"},{"v":0.7,"d":"0.70"},{"v":0.8333333333333333,"d":"0.83"},0.75,{"v":0.42222222222222217,"d":"0.42"},0.38]
[{"$f":"Requirment[[#This Row],[Production]]&\"_\"&Requirment[[#This Row],[Scenarios ]]&\"_\"&Requirment[[#This Row],[Nb phasis]]&\"_\"&Requirment[[#This Row],[Formula_Name]]","v":"Broiler_2.6 kg alive at 98 days_3 feeds_3_Starter"},{"$f":"Requirment[[#This Row],[Production]]&\"_\"&Requirment[[#This Row],[Scenarios ]]&\"_\"&Requirment[[#This Row],[Nb phasis]]","v":"Broiler_2.6 kg alive at 98 days_3 feeds_3"},"Broiler","2.6 kg alive at 98 days_3 feeds",3,"Starter","0-28 day","France","< 28 day broiler",{"v":11.506276150627615,"d":"11.5"},19,2.2,0,1.05,0.4,0.15,{"v":0.9959057209250857,"d":"1.00"},0.9,{"v":0.38729666924864437,"d":"0.39"},0.35,{"v":0.7524621002545091,"d":"0.75"},0.68,{"v":0.6639371472833904,"d":"0.66"},0.6,{"v":0.1659842868208476,"d":"0.17"},0.15,{"v":12.133891213389122,"d":"12.1"},21,5.5,5,1.15,0.45,0.18,{"v":1.106561912138984,"d":"1.11"},1,{"v":0.49795286046254283,"d":"0.50"},0.45,{"v":0.8631182914684076,"d":"0.86"},0.78,{"v":0.8852495297111873,"d":"0.89"},{"v":0.8,"d":"0.80"},{"v":0.38729666924864437,"d":"0.39"},0.35]
[{"$f":"Requirment[[#This Row],[Production]]&\"_\"&Requirment[[#This Row],[Scenarios ]]&\"_\"&Requirment[[#This Row],[Nb phasis]]&\"_\"&Requirment[[#This Row],[Formula_Name]]","v":"Broiler_2.4 kg alive 84 days_2_Finishing"},{"$f":"Requirment[[#This Row],[Production]]&\"_\"&Requirment[[#This Row],[Scenarios ]]&\"_\"&Requirment[[#This Row],[Nb phasis]]","v":"Broiler_2.4 kg alive 84 days_2"},"Broiler","2.4 kg alive 84 days",2,"Finishing","28-63 days","Germany","broiler",11.2,17,4,2.5,0.7,0.7,0.2,{"v":0.7,"d":"0.70"},{"v":0.6299999999999999,"d":"0.63"},{"v":0.3,"d":"0.30"},{"v":0.26999999999999996,"d":"0.27"},{"v":0.52955,"d":"0.53"},{"v":0.47659499999999994,"d":"0.48"},{"v":0.47298999999999997,"d":"0.47"},{"v":0.42569099999999993,"d":"0.43"},{"v":0.126,"d":"0.13"},{"v":0.11339999999999997,"d":"0.11"},11.2,17,4,2.5,0.7,0.7,0.2,{"v":0.7,"d":"0.70"},0.6299999999999999,{"v":0.3,"d":"0.30"},{"v":0.26999999999999996,"d":"0.27"},{"v":0.52955,"d":"0.53"},{"v":0.47659499999999994,"d":"0.48"},{"v":0.47298999999999997,"d":"0.47"},{"v":0.42569099999999993,"d":"0.43"},{"v":0.126,"d":"0.13"},{"v":0.11339999999999997,"d":"0.11"}]
[{"$f":"Requirment[[#This Row],[Production]]&\"_\"&Requirment[[#This Row],[Scenarios ]]&\"_\"&Requirment[[#This Row],[Nb phasis]]&\"_\"&Requirment[[#This Row],[Formula_Name]]","v":"Broiler_2.4 kg alive 84 days_2_Starter"},{"$f":"Requirment[[#This Row],[Production]]&\"_\"&Requirment[[#This Row],[Scenarios ]]&\"_\"&Requirment[[#This Row],[Nb phasis]]","v":"Broiler_2.4 kg alive 84 days_2"},"Broiler","2.4 kg alive 84 days",2,"Starter","0-21 days","Germany","< 28 day broiler",11.2,21,4,2,0.9,0.7,0.2,{"v":1,"d":"1.00"},{"v":0.9037000000000001,"d":"0.90"},{"v":0.3,"d":"0.30"},{"v":0.27111,"d":"0.27"},{"v":0.7576,"d":"0.76"},{"v":0.68464312,"d":"0.68"},{"v":0.6667000000000001,"d":"0.67"},{"v":0.6024967900000001,"d":"0.60"},{"v":0.16670000000000001,"d":"0.17"},{"v":0.15064679000000003,"d":"0.15"},11.2,21,8,2,0.9,0.7,0.2,{"v":1,"d":"1.00"},{"v":0.9037000000000001,"d":"0.90"},{"v":0.3,"d":"0.30"},{"v":0.27111,"d":"0.27"},{"v":0.7576,"d":"0.76"},{"v":0.68464312,"d":"0.68"},{"v":0.6667000000000001,"d":"0.67"},{"v":0.6024967900000001,"d":"0.60"},{"v":0.16670000000000001,"d":"0.17"},{"v":0.15064679000000003,"d":"0.15"}]
[{"$f":"Requirment[[#This Row],[Production]]&\"_\"&Requirment[[#This Row],[Scenarios ]]&\"_\"&Requirment[[#This Row],[Nb phasis]]&\"_\"&Requirment[[#This Row],[Formula_Name]]","v":"Pullets_Growers_2_Growing"},{"$f":"Requirment[[#This Row],[Production]]&\"_\"&Requirment[[#This Row],[Scenarios ]]&\"_\"&Requirment[[#This Row],[Nb phasis]]","v":"Pullets_Growers_2"},"Pullets","Growers",2,"Growing","42-140/161 days","France","broiler",{"v":10.878661087866108,"d":"10.9"},16,2,0,1,0.35,0.12,{"v":0.6888888888888889,"d":"0.69"},0.62,{"v":0.26666666666666666,"d":"0.27"},0.24,{"v":0.5222222222222223,"d":"0.52"},0.47,{"v":0.48888888888888893,"d":"0.49"},0.44,{"v":0.12222222222222223,"d":"0.12"},0.11,{"v":11.715481171548117,"d":"11.7"},18,7,7,1.1,0.45,0.22,{"v":0.8,"d":"0.80"},0.72,{"v":0.3777777777777778,"d":"0.38"},0.34,{"v":0.6333333333333333,"d":"0.63"},0.57,{"v":0.7111111111111112,"d":"0.71"},0.64,{"v":0.3444444444444445,"d":"0.34"},0.31]
[{"$f":"Requirment[[#This Row],[Production]]&\"_\"&Requirment[[#This Row],[Scenarios ]]&\"_\"&Requirment[[#This Row],[Nb phasis]]&\"_\"&Requirment[[#This Row],[Formula_Name]]","v":"Pullets_Growers_2_Starter"},{"$f":"Requirment[[#This Row],[Production]]&\"_\"&Requirment[[#This Row],[Scenarios ]]&\"_\"&Requirment[[#This Row],[Nb phasis]]","v":"Pullets_Growers_2"},"Pullets","Growers",2,"Starter","0-42 days","France","< 28 day broiler",{"v":11.506276150627615,"d":"11.5"},19,2,0,1,0.4,0.15,{"v":0.9405776253181365,"d":"0.94"},0.85,{"v":0.3540998118844749,"d":"0.35"},0.32,{"v":0.7081996237689498,"d":"0.71"},0.64,{"v":0.6639371472833905,"d":"0.66"},0.6,{"v":0.16598428682084762,"d":"0.17"},0.15,{"v":11.92468619246862,"d":"11.9"},21,5,5,1.1,0.45,0.18,{"v":1.051233816532035,"d":"1.05"},0.95,{"v":0.46475600309837334,"d":"0.46"},0.42,{"v":0.8188558149828482,"d":"0.82"},0.74,{"v":0.8852495297111874,"d":"0.89"},{"v":0.8,"d":"0.80"},{"v":0.387296669248644,"d":"0.39"},0.35]
[{"$f":"Requirment[[#This Row],[Production]]&\"_\"&Requirment[[#This Row],[Scenarios ]]&\"_\"&Requirment[[#This Row],[Nb phasis]]&\"_\"&Requirment[[#This Row],[Formula_Name]]","v":"Laying Hen_High level 250 to 300 eggs per year_ 2 Feeds_2_Laying"},{"$f":"Requirment[[#This Row],[Production]]&\"_\"&Requirment[[#This Row],[Scenarios ]]&\"_\"&Requirment[[#This Row],[Nb phasis]]","v":"Laying Hen_High level 250 to 300 eggs per year_ 2 Feeds_2"},"Laying Hen","High level 250 to 300 eggs per year_ 2 Feeds",2,"Laying",">42 weeks","France","Hen",{"v":11.087866108786612,"d":"11.1"},15,4,0,3.5,0.31,0.13,{"v":0.6873239436619718,"d":"0.69"},0.61,{"v":0.32676056338028164,"d":"0.33"},0.29,{"v":0.6422535211267605,"d":"0.64"},0.57,{"v":0.4732394366197183,"d":"0.47"},0.42,{"v":0.14647887323943662,"d":"0.15"},0.13,{"v":11.506276150627615,"d":"11.5"},19,7,7,{"$nulls":3},{"v":0.8,"d":"0.80"},0.71,{"v":0,"d":"0.00"},null,{"v":0,"d":"0.00"},null,{"v":0,"d":"0.00"},null,{"v":0,"d":"0.00"}]
[{"$f":"Requirment[[#This Row],[Production]]&\"_\"&Requirment[[#This Row],[Scenarios ]]&\"_\"&Requirment[[#This Row],[Nb phasis]]&\"_\"&Requirment[[#This Row],[Formula_Name]]","v":"Laying Hen_High level 250 to 300 eggs per year_ 2 Feeds_2_Starter laying"},{"$f":"Requirment[[#This Row],[Production]]&\"_\"&Requirment[[#This Row],[Scenarios ]]&\"_\"&Requirment[[#This Row],[Nb phasis]]","v":"Laying Hen_High level 250 to 300 eggs per year_ 2 Feeds_2"},"Laying Hen","High level 250 to 300 eggs per year_ 2 Feeds",2,"Starter laying","<42 weeks","France","Hen",{"v":11.297071129707113,"d":"11.3"},15,4,0,3.5,0.31,0.13,{"v":0.7323943661971831,"d":"0.73"},0.65,{"v":0.3380281690140845,"d":"0.34"},0.3,{"v":0.6873239436619718,"d":"0.69"},0.61,{"v":0.5070422535211268,"d":"0.51"},0.45,{"v":0.15774647887323945,"d":"0.16"},0.14,{"v":12.133891213389122,"d":"12.1"},20,7,7,{"$nulls":3},{"v":0.8450704225352113,"d":"0.85"},0.75,{"v":0,"d":"0.00"},null,{"v":0,"d":"0.00"},null,{"v":0,"d":"0.00"},null,{"v":0,"d":"0.00"}]
[0,{"$f":"Requirment[[#This Row],[Production]]&\"_\"&Requirment[[#This Row],[Scenarios ]]&\"_\"&Requirment[[#This Row],[Nb phasis]]","v":"Laying Hen_High level 250 to 300 eggs per year_ 3 Feeds_2"},"Laying Hen","High level 250 to 300 eggs per year_ 3 Feeds",2,"Laying","41-80 weeks","Germany ","Hen",10.9,17.95,4,0,4.4,0.58,0.17,0.84,{"v":0.7979999999999999,"d":"0.80"},0.42,{"v":0.39899999999999997,"d":"0.40"},0.77,0.7315,0.59,{"v":0.5605,"d":"0.56"},0.18,0.17099999999999999,10.9,17.95,4,null,4.4,0.58,0.17,0.84,0.7979999999999999,0.42,{"v":0.39899999999999997,"d":"0.40"},0.77,{"v":0.7315,"d":"0.73"},0.59,{"v":0.5605,"d":"0.56"},0.18,{"v":0.17099999999999999,"d":"0.17"}]
[{"$f":"Requirment[[#This Row],[Production]]&\"_\"&Requirment[[#This Row],[Scenarios ]]&\"_\"&Requirment[[#This Row],[Nb phasis]]&\"_\"&Requirment[[#This Row],[Formula_Name]]","v":"Laying Hen_High level 250 to 300 eggs per year_ 3 Feeds_2_Laying"},{"$f":"Requirment[[#This Row],[Production]]&\"_\"&Requirment[[#This Row],[Scenarios ]]&\"_\"&Requirment[[#This Row],[Nb phasis]]","v":"Laying Hen_High level 250 to 300 eggs per year_ 3 Feeds_2"},"Laying Hen","High level 250 to 300 eggs per year_ 3 Feeds",2,"Laying",null,"Germany ","Hen",{"v":11.401673640167363,"d":"11.40"},17.02,{"v":4,"d":"4.00"},0,{"v":4.5,"d":"4.50"},0.55,0.16,{"v":0.8,"d":"0.80"},0.76,{"v":0.4,"d":"0.40"},{"v":0.38000000000000006,"d":"0.38"},0.73,{"v":0.6934999999999999,"d":"0.69"},0.55,{"v":0.5225,"d":"0.52"},0.17,{"v":0.1615,"d":"0.16"},{"v":11.401673640167363,"d":"11.4"},17.02,null,null,4.5,0.55,0.16,{"v":0.8,"d":"0.80"},0.76,{"v":0.4,"d":"0.40"},{"v":0.38000000000000006,"d":"0.38"},0.73,{"v":0.6934999999999999,"d":"0.69"},0.55,{"v":0.5225,"d":"0.52"},0.17,{"v":0.1615,"d":"0.16"}]
[{"$f":"Requirment[[#This Row],[Production]]&\"_\"&Requirment[[#This Row],[Scenarios ]]&\"_\"&Requirment[[#This Row],[Nb phasis]]&\"_\"&Requirment[[#This Row],[Formula_Name]]","v":"Laying Hen_High level 250 to 300 eggs per year_ 3 Feeds_2_Starter laying"},{"$f":"Requirment[[#This Row],[Production]]&\"_\"&Requirment[[#This Row],[Scenarios ]]&\"_\"&Requirment[[#This Row],[Nb phasis]]","v":"Laying Hen_High level 250 to 300 eggs per year_ 3 Feeds_2"},"Laying Hen","High level 250 to 300 eggs per year_ 3 Feeds",2,"Starter laying","19-40 weeks","Germany ","Hen",10.9,18.7,4,0,4.1,0.6,0.18,0.88,{"v":0.836,"d":"0.84"},0.44,{"v":0.418,"d":"0.42"},{"v":0.8,"d":"0.80"},0.7600000000000001,0.61,{"v":0.5795,"d":"0.58"},0.18,0.17099999999999996,{"v":10.9,"d":"10.90"},{"v":18.7,"d":"18.70"},{"v":4,"d":"4.00"},null,{"v":4.1,"d":"4.10"},{"v":0.6,"d":"0.60"},0.18,0.88,{"v":0.836,"d":"0.84"},0.44,{"v":0.418,"d":"0.42"},{"v":0.8,"d":"0.80"},{"v":0.7600000000000001,"d":"0.76"},0.61,{"v":0.5795,"d":"0.58"},0.18,{"v":0.17099999999999996,"d":"0.17"}]
[{"$f":"Requirment[[#This Row],[Production]]&\"_\"&Requirment[[#This Row],[Scenarios ]]&\"_\"&Requirment[[#This Row],[Nb phasis]]&\"_\"&Requirment[[#This Row],[Formula_Name]]","v":"Laying Hen_Low level 170 eggs per year_ 2 Feeds_2_Laying"},{"$f":"Requirment[[#This Row],[Production]]&\"_\"&Requirment[[#This Row],[Scenarios ]]&\"_\"&Requirment[[#This Row],[Nb phasis]]","v":"Laying Hen_Low level 170 eggs per year_ 2 Feeds_2"},"Laying Hen","Low level 170 eggs per year_ 2 Feeds",2,"Laying",">42 weeks","France","Hen",{"v":11.087866108786612,"d":"11.1"},15,4,0,3.5,0.31,0.13,{"v":0.6985915492957746,"d":"0.70"},0.62,{"v":0.28169014084507044,"d":"0.28"},0.25,{"v":0.5633802816901409,"d":"0.56"},0.5,{"v":0.47323943661971823,"d":"0.47"},0.42,{"v":0.14647887323943662,"d":"0.15"},0.13,{"v":11.506276150627615,"d":"11.5"},18,7,7,{"$nulls":3},{"v":0.8112676056338028,"d":"0.81"},0.72,{"v":0,"d":"0.00"},null,{"v":0,"d":"0.00"},null,{"v":0,"d":"0.00"},null,{"v":0,"d":"0.00"}]
[{"$f":"Requirment[[#This Row],[Production]]&\"_\"&Requirment[[#This Row],[Scenarios ]]&\"_\"&Requirment[[#This Row],[Nb phasis]]&\"_\"&Requirment[[#This Row],[Formula_Name]]","v":"Laying Hen_Low level 170 eggs per year_ 2 Feeds_2_Starter laying"},{"$f":"Requirment[[#This Row],[Production]]&\"_\"&Requirment[[#This Row],[Scenarios ]]&\"_\"&Requirment[[#This Row],[Nb phasis]]","v":"Laying Hen_Low level 170 eggs per year_ 2 Feeds_2"},"Laying Hen","Low level 170 eggs per year_ 2 Feeds",2,"Starter laying","<42 weeks","France","Hen",{"v":11.297071129707113,"d":"11.3"},15,4,0,3.5,0.31,0.13,{"v":0.676056338028169,"d":"0.68"},0.6,{"v":0.3154929577464789,"d":"0.32"},0.28,{"v":0.6309859154929578,"d":"0.63"},0.56,{"v":0.4732394366197183,"d":"0.47"},0.42,{"v":0.15774647887323945,"d":"0.16"},0.14,{"v":12.133891213389122,"d":"12.1"},18,7,7,{"$nulls":3},{"v":0.7887323943661971,"d":"0.79"},0.7,{"v":0,"d":"0.00"},null,{"v":0,"d":"0.00"},null,{"v":0,"d":"0.00"},null,{"v":0,"d":"0.00"}]
[{"$f":"Requirment[[#This Row],[Production]]&\"_\"&Requirment[[#This Row],[Scenarios ]]&\"_\"&Requirment[[#This Row],[Nb phasis]]&\"_\"&Requirment[[#This Row],[Formula_Name]]","v":"Laying hens_One feed ans grains  no Min Max_1_Single feed"},{"$f":"Requirment[[#This Row],[Production]]&\"_\"&Requirment[[#This Row],[Scenarios ]]&\"_\"&Requirment[[#This Row],[Nb phasis]]","v":"Laying hens_One feed ans grains  no Min Max_1"},"Laying hens","One feed ans grains  no Min Max",1,"Single feed","42 weeks","Switzerland","Hen",{"v":0,"d":"0.0"},20,2,4,5,0.64,0.17,{"v":1.1267605633802817,"d":"1.13"},1,{"v":0.45070422535211274,"d":"0.45"},0.4,{"v":0.9464788732394366,"d":"0.95"},0.84,{"v":0,"d":"0.00"},null,{"v":0,"d":"0.00"},null,{"v":0,"d":"0.0"}]
[{"$f":"Requirment[[#This Row],[Production]]&\"_\"&Requirment[[#This Row],[Scenarios ]]&\"_\"&Requirment[[#This Row],[Nb phasis]]&\"_\"&Requirment[[#This Row],[Formula_Name]]","v":"Broiler_Broiler_2.6 kg alive at 98 days_3 feeds_3_Finishing_Red clover silage_3_Finishing"},{"$f":"Requirment[[#This Row],[Production]]&\"_\"&Requirment[[#This Row],[Scenarios ]]&\"_\"&Requirment[[#This Row],[Nb phasis]]","v":"Broiler_Broiler_2.6 kg alive at 98 days_3 feeds_3_Finishing_Red clover silage_3"},"Broiler","Broiler_2.6 kg alive at 98 days_3 feeds_3_Finishing_Red clover silage",3,"Finishing","63-98 day","France","broiler",12.953212459321247,17.11249122807018,4.560016220600162,3.500000000000001,0.86333419666753,0.407000407000407,0.7030007030007032,{"v":0.629000629000629,"d":"0.63"},0.29600029600029604,{"v":0.7777777777777777,"d":"0.78"},0.3429444444444445,{"v":0.6228333333333335,"d":"0.62"},0.48627777777777786,{"v":0.2666666666666667,"d":"0.27"},0.8865555555555558,{"v":0.3333333333333333,"d":"0.33"},0.18333333333333332,0,0,0,0,0,0,0,{"v":0,"d":"0.00"},0,{"v":0,"d":"0.00"},{"v":0,"d":"0.00"},{"v":0,"d":"0.00"},{"v":0,"d":"0.00"},{"v":0,"d":"0.00"},{"v":0,"d":"0.00"},{"v":0,"d":"0.00"},{"v":0,"d":"0.00"}]
[{"$f":"Requirment[[#This Row],[Production]]&\"_\"&Requirment[[#This Row],[Scenarios ]]&\"_\"&Requirment[[#This Row],[Nb phasis]]&\"_\"&Requirment[[#This Row],[Formula_Name]]","v":"___"},{"$f":"Requirment[[#This Row],[Production]]&\"_\"&Requirment[[#This Row],[Scenarios ]]&\"_\"&Requirment[[#This Row],[Nb phasis]]","v":"__"}]
[{"$f":"Requirment[[#This Row],[Production]]&\"_\"&Requirment[[#This Row],[Scenarios ]]&\"_\"&Requirment[[#This Row],[Nb phasis]]&\"_\"&Requirment[[#This Row],[Formula_Name]]","v":"___"},{"$f":"Requirment[[#This Row],[Production]]&\"_\"&Requirment[[#This Row],[Scenarios ]]&\"_\"&Requirment[[#This Row],[Nb phasis]]","v":"__"}]
[{"$f":"Requirment[[#This Row],[Production]]&\"_\"&Requirment[[#This Row],[Scenarios ]]&\"_\"&Requirment[[#This Row],[Nb phasis]]&\"_\"&Requirment[[#This Row],[Formula_Name]]","v":"___"},{"$f":"Requirment[[#This Row],[Production]]&\"_\"&Requirment[[#This Row],[Scenarios ]]&\"_\"&Requirment[[#This Row],[Nb phasis]]","v":"__"}]
[{"$f":"Requirment[[#This Row],[Production]]&\"_\"&Requirment[[#This Row],[Scenarios ]]&\"_\"&Requirment[[#This Row],[Nb phasis]]&\"_\"&Requirment[[#This Row],[Formula_Name]]","v":"___"},{"$f":"Requirment[[#This Row],[Production]]&\"_\"&Requirment[[#This Row],[Scenarios ]]&\"_\"&Requirment[[#This Row],[Nb phasis]]","v":"__"}]
[{"$f":"Requirment[[#This Row],[Production]]&\"_\"&Requirment[[#This Row],[Scenarios ]]&\"_\"&Requirment[[#This Row],[Nb phasis]]&\"_\"&Requirment[[#This Row],[Formula_Name]]","v":"___"},{"$f":"Requirment[[#This Row],[Production]]&\"_\"&Requirment[[#This Row],[Scenarios ]]&\"_\"&Requirment[[#This Row],[Nb phasis]]","v":"__"}]
[{"$f":"Requirment[[#This Row],[Production]]&\"_\"&Requirment[[#This Row],[Scenarios ]]&\"_\"&Requirment[[#This Row],[Nb phasis]]&\"_\"&Requirment[[#This Row],[Formula_Name]]","v":"___"},{"$f":"Requirment[[#This Row],[Production]]&\"_\"&Requirment[[#This Row],[Scenarios ]]&\"_\"&Requirment[[#This Row],[Nb phasis]]","v":"__"}]
[{"$f":"Requirment[[#This Row],[Production]]&\"_\"&Requirment[[#This Row],[Scenarios ]]&\"_\"&Requirment[[#This Row],[Nb phasis]]&\"_\"&Requirment[[#This Row],[Formula_Name]]","v":"___"},{"$f":"Requirment[[#This Row],[Production]]&\"_\"&Requirment[[#This Row],[Scenarios ]]&\"_\"&Requirment[[#This Row],[Nb phasis]]","v":"__"}]
[{"$f":"Requirment[[#This Row],[Production]]&\"_\"&Requirment[[#This Row],[Scenarios ]]&\"_\"&Requirment[[#This Row],[Nb phasis]]&\"_\"&Requirment[[#This Row],[Formula_Name]]","v":"___"},{"$f":"Requirment[[#This Row],[Production]]&\"_\"&Requirment[[#This Row],[Scenarios ]]&\"_\"&Requirment[[#This Row],[Nb phasis]]","v":"__"}]
[{"$f":"Requirment[[#This Row],[Production]]&\"_\"&Requirment[[#This Row],[Scenarios ]]&\"_\"&Requirment[[#This Row],[Nb phasis]]&\"_\"&Requirment[[#This Row],[Formula_Name]]","v":"___"},{"$f":"Requirment[[#This Row],[Production]]&\"_\"&Requirment[[#This Row],[Scenarios ]]&\"_\"&Requirment[[#This Row],[Nb phasis]]","v":"__"}]
[{"$f":"Requirment[[#This Row],[Production]]&\"_\"&Requirment[[#This Row],[Scenarios ]]&\"_\"&Requirment[[#This Row],[Nb phasis]]&\"_\"&Requirment[[#This Row],[Formula_Name]]","v":"___"},{"$f":"Requirment[[#This Row],[Production]]&\"_\"&Requirment[[#This Row],[Scenarios ]]&\"_\"&Requirment[[#This Row],[Nb phasis]]","v":"__"}]
[{"$f":"Requirment[[#This Row],[Production]]&\"_\"&Requirment[[#This Row],[Scenarios ]]&\"_\"&Requirment[[#This Row],[Nb phasis]]&\"_\"&Requirment[[#This Row],[Formula_Name]]","v":"___"},{"$f":"Requirment[[#This Row],[Production]]&\"_\"&Requirment[[#This Row],[Scenarios ]]&\"_\"&Requirment[[#This Row],[Nb phasis]]","v":"__"}]
[{"$f":"Requirment[[#This Row],[Production]]&\"_\"&Requirment[[#This Row],[Scenarios ]]&\"_\"&Requirment[[#This Row],[Nb phasis]]&\"_\"&Requirment[[#This Row],[Formula_Name]]","v":"___"},{"$f":"Requirment[[#This Row],[Production]]&\"_\"&Requirment[[#This Row],[Scenarios ]]&\"_\"&Requirment[[#This Row],[Nb phasis]]","v":"__"}]
[{"$f":"Requirment[[#This Row],[Production]]&\"_\"&Requirment[[#This Row],[Scenarios ]]&\"_\"&Requirment[[#This Row],[Nb phasis]]&\"_\"&Requirment[[#This Row],[Formula_Name]]","v":"___"},{"$f":"Requirment[[#This Row],[Production]]&\"_\"&Requirment[[#This Row],[Scenarios ]]&\"_\"&Requirment[[#This Row],[Nb phasis]]","v":"__"}]
[{"$f":"Requirment[[#This Row],[Production]]&\"_\"&Requirment[[#This Row],[Scenarios ]]&\"_\"&Requirment[[#This Row],[Nb phasis]]&\"_\"&Requirment[[#This Row],[Formula_Name]]","v":"___"},{"$f":"Requirment[[#This Row],[Production]]&\"_\"&Requirment[[#This Row],[Scenarios ]]&\"_\"&Requirment[[#This Row],[Nb phasis]]","v":"__"}]
[{"$f":"Requirment[[#This Row],[Production]]&\"_\"&Requirment[[#This Row],[Scenarios ]]&\"_\"&Requirment[[#This Row],[Nb phasis]]&\"_\"&Requirment[[#This Row],[Formula_Name]]","v":"___"},{"$f":"Requirment[[#This Row],[Production]]&\"_\"&Requirment[[#This Row],[Scenarios ]]&\"_\"&Requirment[[#This Row],[Nb phasis]]","v":"__"}]
[{"$f":"Requirment[[#This Row],[Production]]&\"_\"&Requirment[[#This Row],[Scenarios ]]&\"_\"&Requirment[[#This Row],[Nb phasis]]&\"_\"&Requirment[[#This Row],[Formula_Name]]","v":"___"},{"$f":"Requirment[[#This Row],[Production]]&\"_\"&Requirment[[#This Row],[Scenarios ]]&\"_\"&Requirment[[#This Row],[Nb phasis]]","v":"__"}]
[{"$f":"Requirment[[#This Row],[Production]]&\"_\"&Requirment[[#This Row],[Scenarios ]]&\"_\"&Requirment[[#This Row],[Nb phasis]]&\"_\"&Requirment[[#This Row],[Formula_Name]]","v":"___"},{"$f":"Requirment[[#This Row],[Production]]&\"_\"&Requirment[[#This Row],[Scenarios ]]&\"_\"&Requirment[[#This Row],[Nb phasis]]","v":"__"}]
[{"$f":"Requirment[[#This Row],[Production]]&\"_\"&Requirment[[#This Row],[Scenarios ]]&\"_\"&Requirment[[#This Row],[Nb phasis]]&\"_\"&Requirment[[#This Row],[Formula_Name]]","v":"___"},{"$f":"Requirment[[#This Row],[Production]]&\"_\"&Requirment[[#This Row],[Scenarios ]]&\"_\"&Requirment[[#This Row],[Nb phasis]]","v":"__"}]
[{"$f":"Requirment[[#This Row],[Production]]&\"_\"&Requirment[[#This Row],[Scenarios ]]&\"_\"&Requirment[[#This Row],[Nb phasis]]&\"_\"&Requirment[[#This Row],[Formula_Name]]","v":"___"},{"$f":"Requirment[[#This Row],[Production]]&\"_\"&Requirment[[#This Row],[Scenarios ]]&\"_\"&Requirment[[#This Row],[Nb phasis]]","v":"__"}]
[{"$f":"Requirment[[#This Row],[Production]]&\"_\"&Requirment[[#This Row],[Scenarios ]]&\"_\"&Requirment[[#This Row],[Nb phasis]]&\"_\"&Requirment[[#This Row],[Formula_Name]]","v":"___"},{"$f":"Requirment[[#This Row],[Production]]&\"_\"&Requirment[[#This Row],[Scenarios ]]&\"_\"&Requirment[[#This Row],[Nb phasis]]","v":"__"}]
[{"$f":"Requirment[[#This Row],[Production]]&\"_\"&Requirment[[#This Row],[Scenarios ]]&\"_\"&Requirment[[#This Row],[Nb phasis]]&\"_\"&Requirment[[#This Row],[Formula_Name]]","v":"___"},{"$f":"Requirment[[#This Row],[Production]]&\"_\"&Requirment[[#This Row],[Scenarios ]]&\"_\"&Requirment[[#This Row],[Nb phasis]]","v":"__"}]
[{"$f":"Requirment[[#This Row],[Production]]&\"_\"&Requirment[[#This Row],[Scenarios ]]&\"_\"&Requirment[[#This Row],[Nb phasis]]&\"_\"&Requirment[[#This Row],[Formula_Name]]","v":"___"},{"$f":"Requirment[[#This Row],[Production]]&\"_\"&Requirment[[#This Row],[Scenarios ]]&\"_\"&Requirment[[#This Row],[Nb phasis]]","v":"__"}]
[{"$f":"Requirment[[#This Row],[Production]]&\"_\"&Requirment[[#This Row],[Scenarios ]]&\"_\"&Requirment[[#This Row],[Nb phasis]]&\"_\"&Requirment[[#This Row],[Formula_Name]]","v":"___"},{"$f":"Requirment[[#This Row],[Production]]&\"_\"&Requirment[[#This Row],[Scenarios ]]&\"_\"&Requirment[[#This Row],[Nb phasis]]","v":"__"}]
[{"$f":"Requirment[[#This Row],[Production]]&\"_\"&Requirment[[#This Row],[Scenarios ]]&\"_\"&Requirment[[#This Row],[Nb phasis]]&\"_\"&Requirment[[#This Row],[Formula_Name]]","v":"___"},{"$f":"Requirment[[#This Row],[Production]]&\"_\"&Requirment[[#This Row],[Scenarios ]]&\"_\"&Requirment[[#This Row],[Nb phasis]]","v":"__"}]
[{"$f":"Requirment[[#This Row],[Production]]&\"_\"&Requirment[[#This Row],[Scenarios ]]&\"_\"&Requirment[[#This Row],[Nb phasis]]&\"_\"&Requirment[[#This Row],[Formula_Name]]","v":"___"},{"$f":"Requirment[[#This Row],[Production]]&\"_\"&Requirment[[#This Row],[Scenarios ]]&\"_\"&Requirment[[#This Row],[Nb phasis]]","v":"__"}]
[{"$f":"Requirment[[#This Row],[Production]]&\"_\"&Requirment[[#This Row],[Scenarios ]]&\"_\"&Requirment[[#This Row],[Nb phasis]]&\"_\"&Requirment[[#This Row],[Formula_Name]]","v":"___"},{"$f":"Requirment[[#This Row],[Production]]&\"_\"&Requirment[[#This Row],[Scenarios ]]&\"_\"&Requirment[[#This Row],[Nb phasis]]","v":"__"}]
[{"$f":"Requirment[[#This Row],[Production]]&\"_\"&Requirment[[#This Row],[Scenarios ]]&\"_\"&Requirment[[#This Row],[Nb phasis]]&\"_\"&Requirment[[#This Row],[Formula_Name]]","v":"___"},{"$f":"Requirment[[#This Row],[Production]]&\"_\"&Requirment[[#This Row],[Scenarios ]]&\"_\"&Requirment[[#This Row],[Nb phasis]]","v":"__"}]
[{"$f":"Requirment[[#This Row],[Production]]&\"_\"&Requirment[[#This Row],[Scenarios ]]&\"_\"&Requirment[[#This Row],[Nb phasis]]&\"_\"&Requirment[[#This Row],[Formula_Name]]","v":"___"},{"$f":"Requirment[[#This Row],[Production]]&\"_\"&Requirment[[#This Row],[Scenarios ]]&\"_\"&Requirment[[#This Row],[Nb phasis]]","v":"__"}]
[{"$f":"Requirment[[#This Row],[Production]]&\"_\"&Requirment[[#This Row],[Scenarios ]]&\"_\"&Requirment[[#This Row],[Nb phasis]]&\"_\"&Requirment[[#This Row],[Formula_Name]]","v":"___"},{"$f":"Requirment[[#This Row],[Production]]&\"_\"&Requirment[[#This Row],[Scenarios ]]&\"_\"&Requirment[[#This Row],[Nb phasis]]","v":"__"}]
[{"$f":"Requirment[[#This Row],[Production]]&\"_\"&Requirment[[#This Row],[Scenarios ]]&\"_\"&Requirment[[#This Row],[Nb phasis]]&\"_\"&Requirment[[#This Row],[Formula_Name]]","v":"___"},{"$f":"Requirment[[#This Row],[Production]]&\"_\"&Requirment[[#This Row],[Scenarios ]]&\"_\"&Requirment[[#This Row],[Nb phasis]]","v":"__"}]
[{"$f":"Requirment[[#This Row],[Production]]&\"_\"&Requirment[[#This Row],[Scenarios ]]&\"_\"&Requirment[[#This Row],[Nb phasis]]&\"_\"&Requirment[[#This Row],[Formula_Name]]","v":"___"},{"$f":"Requirment[[#This Row],[Production]]&\"_\"&Requirment[[#This Row],[Scenarios ]]&\"_\"&Requirment[[#This Row],[Nb phasis]]","v":"__"}]
[{"$f":"Requirment[[#This Row],[Production]]&\"_\"&Requirment[[#This Row],[Scenarios ]]&\"_\"&Requirment[[#This Row],[Nb phasis]]&\"_\"&Requirment[[#This Row],[Formula_Name]]","v":"___"},{"$f":"Requirment[[#This Row],[Production]]&\"_\"&Requirment[[#This Row],[Scenarios ]]&\"_\"&Requirment[[#This Row],[Nb phasis]]","v":"__"}]
[{"$f":"Requirment[[#This Row],[Production]]&\"_\"&Requirment[[#This Row],[Scenarios ]]&\"_\"&Requirment[[#This Row],[Nb phasis]]&\"_\"&Requirment[[#This Row],[Formula_Name]]","v":"___"},{"$f":"Requirment[[#This Row],[Production]]&\"_\"&Requirment[[#This Row],[Scenarios ]]&\"_\"&Requirment[[#This Row],[Nb phasis]]","v":"__"}]
[{"$f":"Requirment[[#This Row],[Production]]&\"_\"&Requirment[[#This Row],[Scenarios ]]&\"_\"&Requirment[[#This Row],[Nb phasis]]&\"_\"&Requirment[[#This Row],[Formula_Name]]","v":"___"},{"$f":"Requirment[[#This Row],[Production]]&\"_\"&Requirment[[#This Row],[Scenarios ]]&\"_\"&Requirment[[#This Row],[Nb phasis]]","v":"__"}]
[{"$f":"Requirment[[#This Row],[Production]]&\"_\"&Requirment[[#This Row],[Scenarios ]]&\"_\"&Requirment[[#This Row],[Nb phasis]]&\"_\"&Requirment[[#This Row],[Formula_Name]]","v":"___"},{"$f":"Requirment[[#This Row],[Production]]&\"_\"&Requirment[[#This Row],[Scenarios ]]&\"_\"&Requirment[[#This Row],[Nb phasis]]","v":"__"}]
[{"$f":"Requirment[[#This Row],[Production]]&\"_\"&Requirment[[#This Row],[Scenarios ]]&\"_\"&Requirment[[#This Row],[Nb phasis]]&\"_\"&Requirment[[#This Row],[Formula_Name]]","v":"___"},{"$f":"Requirment[[#This Row],[Production]]&\"_\"&Requirment[[#This Row],[Scenarios ]]&\"_\"&Requirment[[#This Row],[Nb phasis]]","v":"__"}]
[{"$f":"Requirment[[#This Row],[Production]]&\"_\"&Requirment[[#This Row],[Scenarios ]]&\"_\"&Requirment[[#This Row],[Nb phasis]]&\"_\"&Requirment[[#This Row],[Formula_Name]]","v":"___"},{"$f":"Requirment[[#This Row],[Production]]&\"_\"&Requirment[[#This Row],[Scenarios ]]&\"_\"&Requirment[[#This Row],[Nb phasis]]","v":"__"}]
[{"$f":"Requirment[[#This Row],[Production]]&\"_\"&Requirment[[#This Row],[Scenarios ]]&\"_\"&Requirment[[#This Row],[Nb phasis]]&\"_\"&Requirment[[#This Row],[Formula_Name]]","v":"___"},{"$f":"Requirment[[#This Row],[Production]]&\"_\"&Requirment[[#This Row],[Scenarios ]]&\"_\"&Requirment[[#This Row],[Nb phasis]]","v":"__"}]
[{"$f":"Requirment[[#This Row],[Production]]&\"_\"&Requirment[[#This Row],[Scenarios ]]&\"_\"&Requirment[[#This Row],[Nb phasis]]&\"_\"&Requirment[[#This Row],[Formula_Name]]","v":"___"},{"$f":"Requirment[[#This Row],[Production]]&\"_\"&Requirment[[#This Row],[Scenarios ]]&\"_\"&Requirment[[#This Row],[Nb phasis]]","v":"__"}]
[{"$f":"Requirment[[#This Row],[Production]]&\"_\"&Requirment[[#This Row],[Scenarios ]]&\"_\"&Requirment[[#This Row],[Nb phasis]]&\"_\"&Requirment[[#This Row],[Formula_Name]]","v":"___"},{"$f":"Requirment[[#This Row],[Production]]&\"_\"&Requirment[[#This Row],[Scenarios ]]&\"_\"&Requirment[[#This Row],[Nb phasis]]","v":"__"}]
[{"$f":"Requirment[[#This Row],[Production]]&\"_\"&Requirment[[#This Row],[Scenarios ]]&\"_\"&Requirment[[#This Row],[Nb phasis]]&\"_\"&Requirment[[#This Row],[Formula_Name]]","v":"___"},{"$f":"Requirment[[#This Row],[Production]]&\"_\"&Requirment[[#This Row],[Scenarios ]]&\"_\"&Requirment[[#This Row],[Nb phasis]]","v":"__"}]
[{"$f":"Requirment[[#This Row],[Production]]&\"_\"&Requirment[[#This Row],[Scenarios ]]&\"_\"&Requirment[[#This Row],[Nb phasis]]&\"_\"&Requirment[[#This Row],[Formula_Name]]","v":"___"},{"$f":"Requirment[[#This Row],[Production]]&\"_\"&Requirment[[#This Row],[Scenarios ]]&\"_\"&Requirment[[#This Row],[Nb phasis]]","v":"__"}]
[{"$f":"Requirment[[#This Row],[Production]]&\"_\"&Requirment[[#This Row],[Scenarios ]]&\"_\"&Requirment[[#This Row],[Nb phasis]]&\"_\"&Requirment[[#This Row],[Formula_Name]]","v":"___"},{"$f":"Requirment[[#This Row],[Production]]&\"_\"&Requirment[[#This Row],[Scenarios ]]&\"_\"&Requirment[[#This Row],[Nb phasis]]","v":"__"}]
[{"$f":"Requirment[[#This Row],[Production]]&\"_\"&Requirment[[#This Row],[Scenarios ]]&\"_\"&Requirment[[#This Row],[Nb phasis]]&\"_\"&Requirment[[#This Row],[Formula_Name]]","v":"___"},{"$f":"Requirment[[#This Row],[Production]]&\"_\"&Requirment[[#This Row],[Scenarios ]]&\"_\"&Requirment[[#This Row],[Nb phasis]]","v":"__"}]
[{"$f":"Requirment[[#This Row],[Production]]&\"_\"&Requirment[[#This Row],[Scenarios ]]&\"_\"&Requirment[[#This Row],[Nb phasis]]&\"_\"&Requirment[[#This Row],[Formula_Name]]","v":"___"},{"$f":"Requirment[[#This Row],[Production]]&\"_\"&Requirment[[#This Row],[Scenarios ]]&\"_\"&Requirment[[#This Row],[Nb phasis]]","v":"__"}]
[{"$f":"Requirment[[#This Row],[Production]]&\"_\"&Requirment[[#This Row],[Scenarios ]]&\"_\"&Requirment[[#This Row],[Nb phasis]]&\"_\"&Requirment[[#This Row],[Formula_Name]]","v":"___"},{"$f":"Requirment[[#This Row],[Production]]&\"_\"&Requirment[[#This Row],[Scenarios ]]&\"_\"&Requirment[[#This Row],[Nb phasis]]","v":"__"}]
[{"$f":"Requirment[[#This Row],[Production]]&\"_\"&Requirment[[#This Row],[Scenarios ]]&\"_\"&Requirment[[#This Row],[Nb phasis]]&\"_\"&Requirment[[#This Row],[Formula_Name]]","v":"___"},{"$f":"Requirment[[#This Row],[Production]]&\"_\"&Requirment[[#This Row],[Scenarios ]]&\"_\"&Requirment[[#This Row],[Nb phasis]]","v":"__"}]
[{"$f":"Requirment[[#This Row],[Production]]&\"_\"&Requirment[[#This Row],[Scenarios ]]&\"_\"&Requirment[[#This Row],[Nb phasis]]&\"_\"&Requirment[[#This Row],[Formula_Name]]","v":"___"},{"$f":"Requirment[[#This Row],[Production]]&\"_\"&Requirment[[#This Row],[Scenarios ]]&\"_\"&Requirment[[#This Row],[Nb phasis]]","v":"__"}]
[{"$f":"Requirment[[#This Row],[Production]]&\"_\"&Requirment[[#This Row],[Scenarios ]]&\"_\"&Requirment[[#This Row],[Nb phasis]]&\"_\"&Requirment[[#This Row],[Formula_Name]]","v":"___"},{"$f":"Requirment[[#This Row],[Production]]&\"_\"&Requirment[[#This Row],[Scenarios ]]&\"_\"&Requirment[[#This Row],[Nb phasis]]","v":"__"}]
[{"$f":"Requirment[[#This Row],[Production]]&\"_\"&Requirment[[#This Row],[Scenarios ]]&\"_\"&Requirment[[#This Row],[Nb phasis]]&\"_\"&Requirment[[#This Row],[Formula_Name]]","v":"___"},{"$f":"Requirment[[#This Row],[Production]]&\"_\"&Requirment[[#This Row],[Scenarios ]]&\"_\"&Requirment[[#This Row],[Nb phasis]]","v":"__"}]
[{"$f":"Requirment[[#This Row],[Production]]&\"_\"&Requirment[[#This Row],[Scenarios ]]&\"_\"&Requirment[[#This Row],[Nb phasis]]&\"_\"&Requirment[[#This Row],[Formula_Name]]","v":"___"},{"$f":"Requirment[[#This Row],[Production]]&\"_\"&Requirment[[#This Row],[Scenarios ]]&\"_\"&Requirment[[#This Row],[Nb phasis]]","v":"__"}]
[{"$f":"Requirment[[#This Row],[Production]]&\"_\"&Requirment[[#This Row],[Scenarios ]]&\"_\"&Requirment[[#This Row],[Nb phasis]]&\"_\"&Requirment[[#This Row],[Formula_Name]]","v":"___"},{"$f":"Requirment[[#This Row],[Production]]&\"_\"&Requirment[[#This Row],[Scenarios ]]&\"_\"&Requirment[[#This Row],[Nb phasis]]","v":"__"}]
[{"$f":"Requirment[[#This Row],[Production]]&\"_\"&Requirment[[#This Row],[Scenarios ]]&\"_\"&Requirment[[#This Row],[Nb phasis]]&\"_\"&Requirment[[#This Row],[Formula_Name]]","v":"___"},{"$f":"Requirment[[#This Row],[Production]]&\"_\"&Requirment[[#This Row],[Scenarios ]]&\"_\"&Requirment[[#This Row],[Nb phasis]]","v":"__"}]
[{"$f":"Requirment[[#This Row],[Production]]&\"_\"&Requirment[[#This Row],[Scenarios ]]&\"_\"&Requirment[[#This Row],[Nb phasis]]&\"_\"&Requirment[[#This Row],[Formula_Name]]","v":"___"},{"$f":"Requirment[[#This Row],[Production]]&\"_\"&Requirment[[#This Row],[Scenarios ]]&\"_\"&Requirment[[#This Row],[Nb phasis]]","v":"__"}]
[{"$f":"Requirment[[#This Row],[Production]]&\"_\"&Requirment[[#This Row],[Scenarios ]]&\"_\"&Requirment[[#This Row],[Nb phasis]]&\"_\"&Requirment[[#This Row],[Formula_Name]]","v":"___"},{"$f":"Requirment[[#This Row],[Production]]&\"_\"&Requirment[[#This Row],[Scenarios ]]&\"_\"&Requirment[[#This Row],[Nb phasis]]","v":"__"}]
[{"$f":"Requirment[[#This Row],[Production]]&\"_\"&Requirment[[#This Row],[Scenarios ]]&\"_\"&Requirment[[#This Row],[Nb phasis]]&\"_\"&Requirment[[#This Row],[Formula_Name]]","v":"___"},{"$f":"Requirment[[#This Row],[Production]]&\"_\"&Requirment[[#This Row],[Scenarios ]]&\"_\"&Requirment[[#This Row],[Nb phasis]]","v":"__"}]
[{"$f":"Requirment[[#This Row],[Production]]&\"_\"&Requirment[[#This Row],[Scenarios ]]&\"_\"&Requirment[[#This Row],[Nb phasis]]&\"_\"&Requirment[[#This Row],[Formula_Name]]","v":"___"},{"$f":"Requirment[[#This Row],[Production]]&\"_\"&Requirment[[#This Row],[Scenarios ]]&\"_\"&Requirment[[#This Row],[Nb phasis]]","v":"__"}]
[{"$f":"Requirment[[#This Row],[Production]]&\"_\"&Requirment[[#This Row],[Scenarios ]]&\"_\"&Requirment[[#This Row],[Nb phasis]]&\"_\"&Requirment[[#This Row],[Formula_Name]]","v":"___"},{"$f":"Requirment[[#This Row],[Production]]&\"_\"&Requirment[[#This Row],[Scenarios ]]&\"_\"&Requirment[[#This Row],[Nb phasis]]","v":"__"}]
[{"$f":"Requirment[[#This Row],[Production]]&\"_\"&Requirment[[#This Row],[Scenarios ]]&\"_\"&Requirment[[#This Row],[Nb phasis]]&\"_\"&Requirment[[#This Row],[Formula_Name]]","v":"___"},{"$f":"Requirment[[#This Row],[Production]]&\"_\"&Requirment[[#This Row],[Scenarios ]]&\"_\"&Requirment[[#This Row],[Nb phasis]]","v":"__"}]
[{"$f":"Requirment[[#This Row],[Production]]&\"_\"&Requirment[[#This Row],[Scenarios ]]&\"_\"&Requirment[[#This Row],[Nb phasis]]&\"_\"&Requirment[[#This Row],[Formula_Name]]","v":"___"},{"$f":"Requirment[[#This Row],[Production]]&\"_\"&Requirment[[#This Row],[Scenarios ]]&\"_\"&Requirment[[#This Row],[Nb phasis]]","v":"__"}]
[{"$f":"Requirment[[#This Row],[Production]]&\"_\"&Requirment[[#This Row],[Scenarios ]]&\"_\"&Requirment[[#This Row],[Nb phasis]]&\"_\"&Requirment[[#This Row],[Formula_Name]]","v":"___"},{"$f":"Requirment[[#This Row],[Production]]&\"_\"&Requirment[[#This Row],[Scenarios ]]&\"_\"&Requirment[[#This Row],[Nb phasis]]","v":"__"}]
[{"$f":"Requirment[[#This Row],[Production]]&\"_\"&Requirment[[#This Row],[Scenarios ]]&\"_\"&Requirment[[#This Row],[Nb phasis]]&\"_\"&Requirment[[#This Row],[Formula_Name]]","v":"___"},{"$f":"Requirment[[#This Row],[Production]]&\"_\"&Requirment[[#This Row],[Scenarios ]]&\"_\"&Requirment[[#This Row],[Nb phasis]]","v":"__"}]
[{"$f":"Requirment[[#This Row],[Production]]&\"_\"&Requirment[[#This Row],[Scenarios ]]&\"_\"&Requirment[[#This Row],[Nb phasis]]&\"_\"&Requirment[[#This Row],[Formula_Name]]","v":"___"},{"$f":"Requirment[[#This Row],[Production]]&\"_\"&Requirment[[#This Row],[Scenarios ]]&\"_\"&Requirment[[#This Row],[Nb phasis]]","v":"__"}]
[{"$f":"Requirment[[#This Row],[Production]]&\"_\"&Requirment[[#This Row],[Scenarios ]]&\"_\"&Requirment[[#This Row],[Nb phasis]]&\"_\"&Requirment[[#This Row],[Formula_Name]]","v":"___"},{"$f":"Requirment[[#This Row],[Production]]&\"_\"&Requirment[[#This Row],[Scenarios ]]&\"_\"&Requirment[[#This Row],[Nb phasis]]","v":"__"}]
[{"$f":"Requirment[[#This Row],[Production]]&\"_\"&Requirment[[#This Row],[Scenarios ]]&\"_\"&Requirment[[#This Row],[Nb phasis]]&\"_\"&Requirment[[#This Row],[Formula_Name]]","v":"___"},{"$f":"Requirment[[#This Row],[Production]]&\"_\"&Requirment[[#This Row],[Scenarios ]]&\"_\"&Requirment[[#This Row],[Nb phasis]]","v":"__"}]
[{"$f":"Requirment[[#This Row],[Production]]&\"_\"&Requirment[[#This Row],[Scenarios ]]&\"_\"&Requirment[[#This Row],[Nb phasis]]&\"_\"&Requirment[[#This Row],[Formula_Name]]","v":"___"},{"$f":"Requirment[[#This Row],[Production]]&\"_\"&Requirment[[#This Row],[Scenarios ]]&\"_\"&Requirment[[#This Row],[Nb phasis]]","v":"__"}]
[{"$f":"Requirment[[#This Row],[Production]]&\"_\"&Requirment[[#This Row],[Scenarios ]]&\"_\"&Requirment[[#This Row],[Nb phasis]]&\"_\"&Requirment[[#This Row],[Formula_Name]]","v":"___"},{"$f":"Requirment[[#This Row],[Production]]&\"_\"&Requirment[[#This Row],[Scenarios ]]&\"_\"&Requirment[[#This Row],[Nb phasis]]","v":"__"}]
[{"$f":"Requirment[[#This Row],[Production]]&\"_\"&Requirment[[#This Row],[Scenarios ]]&\"_\"&Requirment[[#This Row],[Nb phasis]]&\"_\"&Requirment[[#This Row],[Formula_Name]]","v":"___"},{"$f":"Requirment[[#This Row],[Production]]&\"_\"&Requirment[[#This Row],[Scenarios ]]&\"_\"&Requirment[[#This Row],[Nb phasis]]","v":"__"}]
[{"$f":"Requirment[[#This Row],[Production]]&\"_\"&Requirment[[#This Row],[Scenarios ]]&\"_\"&Requirment[[#This Row],[Nb phasis]]&\"_\"&Requirment[[#This Row],[Formula_Name]]","v":"___"},{"$f":"Requirment[[#This Row],[Production]]&\"_\"&Requirment[[#This Row],[Scenarios ]]&\"_\"&Requirment[[#This Row],[Nb phasis]]","v":"__"}]
[{"$f":"Requirment[[#This Row],[Production]]&\"_\"&Requirment[[#This Row],[Scenarios ]]&\"_\"&Requirment[[#This Row],[Nb phasis]]&\"_\"&Requirment[[#This Row],[Formula_Name]]","v":"___"},{"$f":"Requirment[[#This Row],[Production]]&\"_\"&Requirment[[#This Row],[Scenarios ]]&\"_\"&Requirment[[#This Row],[Nb phasis]]","v":"__"}]
[{"$f":"Requirment[[#This Row],[Production]]&\"_\"&Requirment[[#This Row],[Scenarios ]]&\"_\"&Requirment[[#This Row],[Nb phasis]]&\"_\"&Requirment[[#This Row],[Formula_Name]]","v":"___"},{"$f":"Requirment[[#This Row],[Production]]&\"_\"&Requirment[[#This Row],[Scenarios ]]&\"_\"&Requirment[[#This Row],[Nb phasis]]","v":"__"}]
[{"$f":"Requirment[[#This Row],[Production]]&\"_\"&Requirment[[#This Row],[Scenarios ]]&\"_\"&Requirment[[#This Row],[Nb phasis]]&\"_\"&Requirment[[#This Row],[Formula_Name]]","v":"___"},{"$f":"Requirment[[#This Row],[Production]]&\"_\"&Requirment[[#This Row],[Scenarios ]]&\"_\"&Requirment[[#This Row],[Nb phasis]]","v":"__"}]
[{"$f":"Requirment[[#This Row],[Production]]&\"_\"&Requirment[[#This Row],[Scenarios ]]&\"_\"&Requirment[[#This Row],[Nb phasis]]&\"_\"&Requirment[[#This Row],[Formula_Name]]","v":"___"},{"$f":"Requirment[[#This Row],[Production]]&\"_\"&Requirment[[#This Row],[Scenarios ]]&\"_\"&Requirment[[#This Row],[Nb phasis]]","v":"__"}]
[{"$f":"Requirment[[#This Row],[Production]]&\"_\"&Requirment[[#This Row],[Scenarios ]]&\"_\"&Requirment[[#This Row],[Nb phasis]]&\"_\"&Requirment[[#This Row],[Formula_Name]]","v":"___"},{"$f":"Requirment[[#This Row],[Production]]&\"_\"&Requirment[[#This Row],[Scenarios ]]&\"_\"&Requirment[[#This Row],[Nb phasis]]","v":"__"}]
[{"$f":"Requirment[[#This Row],[Production]]&\"_\"&Requirment[[#This Row],[Scenarios ]]&\"_\"&Requirment[[#This Row],[Nb phasis]]&\"_\"&Requirment[[#This Row],[Formula_Name]]","v":"___"},{"$f":"Requirment[[#This Row],[Production]]&\"_\"&Requirment[[#This Row],[Scenarios ]]&\"_\"&Requirment[[#This Row],[Nb phasis]]","v":"__"}]
[{"$f":"Requirment[[#This Row],[Production]]&\"_\"&Requirment[[#This Row],[Scenarios ]]&\"_\"&Requirment[[#This Row],[Nb phasis]]&\"_\"&Requirment[[#This Row],[Formula_Name]]","v":"___"},{"$f":"Requirment[[#This Row],[Production]]&\"_\"&Requirment[[#This Row],[Scenarios ]]&\"_\"&Requirment[[#This Row],[Nb phasis]]","v":"__"}]
[{"$f":"Requirment[[#This Row],[Production]]&\"_\"&Requirment[[#This Row],[Scenarios ]]&\"_\"&Requirment[[#This Row],[Nb phasis]]&\"_\"&Requirment[[#This Row],[Formula_Name]]","v":"___"},{"$f":"Requirment[[#This Row],[Production]]&\"_\"&Requirment[[#This Row],[Scenarios ]]&\"_\"&Requirment[[#This Row],[Nb phasis]]","v":"__"}]
[{"$f":"Requirment[[#This Row],[Production]]&\"_\"&Requirment[[#This Row],[Scenarios ]]&\"_\"&Requirment[[#This Row],[Nb phasis]]&\"_\"&Requirment[[#This Row],[Formula_Name]]","v":"___"},{"$f":"Requirment[[#This Row],[Production]]&\"_\"&Requirment[[#This Row],[Scenarios ]]&\"_\"&Requirment[[#This Row],[Nb phasis]]","v":"__"}]
[{"$f":"Requirment[[#This Row],[Production]]&\"_\"&Requirment[[#This Row],[Scenarios ]]&\"_\"&Requirment[[#This Row],[Nb phasis]]&\"_\"&Requirment[[#This Row],[Formula_Name]]","v":"___"},{"$f":"Requirment[[#This Row],[Production]]&\"_\"&Requirment[[#This Row],[Scenarios ]]&\"_\"&Requirment[[#This Row],[Nb phasis]]","v":"__"}]
[{"$f":"Requirment[[#This Row],[Production]]&\"_\"&Requirment[[#This Row],[Scenarios ]]&\"_\"&Requirment[[#This Row],[Nb phasis]]&\"_\"&Requirment[[#This Row],[Formula_Name]]","v":"___"},{"$f":"Requirment[[#This Row],[Production]]&\"_\"&Requirment[[#This Row],[Scenarios ]]&\"_\"&Requirment[[#This Row],[Nb phasis]]","v":"__"}]
[{"$f":"Requirment[[#This Row],[Production]]&\"_\"&Requirment[[#This Row],[Scenarios ]]&\"_\"&Requirment[[#This Row],[Nb phasis]]&\"_\"&Requirment[[#This Row],[Formula_Name]]","v":"___"},{"$f":"Requirment[[#This Row],[Production]]&\"_\"&Requirment[[#This Row],[Scenarios ]]&\"_\"&Requirment[[#This Row],[Nb phasis]]","v":"__"}]
[{"$f":"Requirment[[#This Row],[Production]]&\"_\"&Requirment[[#This Row],[Scenarios ]]&\"_\"&Requirment[[#This Row],[Nb phasis]]&\"_\"&Requirment[[#This Row],[Formula_Name]]","v":"___"},{"$f":"Requirment[[#This Row],[Production]]&\"_\"&Requirment[[#This Row],[Scenarios ]]&\"_\"&Requirment[[#This Row],[Nb phasis]]","v":"__"}]
[{"$f":"Requirment[[#This Row],[Production]]&\"_\"&Requirment[[#This Row],[Scenarios ]]&\"_\"&Requirment[[#This Row],[Nb phasis]]&\"_\"&Requirment[[#This Row],[Formula_Name]]","v":"___"},{"$f":"Requirment[[#This Row],[Production]]&\"_\"&Requirment[[#This Row],[Scenarios ]]&\"_\"&Requirment[[#This Row],[Nb phasis]]","v":"__"}]
[{"$f":"Requirment[[#This Row],[Production]]&\"_\"&Requirment[[#This Row],[Scenarios ]]&\"_\"&Requirment[[#This Row],[Nb phasis]]&\"_\"&Requirment[[#This Row],[Formula_Name]]","v":"___"},{"$f":"Requirment[[#This Row],[Production]]&\"_\"&Requirment[[#This Row],[Scenarios ]]&\"_\"&Requirment[[#This Row],[Nb phasis]]","v":"__"}]
[{"$f":"Requirment[[#This Row],[Production]]&\"_\"&Requirment[[#This Row],[Scenarios ]]&\"_\"&Requirment[[#This Row],[Nb phasis]]&\"_\"&Requirment[[#This Row],[Formula_Name]]","v":"___"},{"$f":"Requirment[[#This Row],[Production]]&\"_\"&Requirment[[#This Row],[Scenarios ]]&\"_\"&Requirment[[#This Row],[Nb phasis]]","v":"__"}]
[{"$f":"Requirment[[#This Row],[Production]]&\"_\"&Requirment[[#This Row],[Scenarios ]]&\"_\"&Requirment[[#This Row],[Nb phasis]]&\"_\"&Requirment[[#This Row],[Formula_Name]]","v":"___"},{"$f":"Requirment[[#This Row],[Production]]&\"_\"&Requirment[[#This Row],[Scenarios ]]&\"_\"&Requirment[[#This Row],[Nb phasis]]","v":"__"}]
[{"$f":"Requirment[[#This Row],[Production]]&\"_\"&Requirment[[#This Row],[Scenarios ]]&\"_\"&Requirment[[#This Row],[Nb phasis]]&\"_\"&Requirment[[#This Row],[Formula_Name]]","v":"___"},{"$f":"Requirment[[#This Row],[Production]]&\"_\"&Requirment[[#This Row],[Scenarios ]]&\"_\"&Requirment[[#This Row],[Nb phasis]]","v":"__"}]
[{"$f":"Requirment[[#This Row],[Production]]&\"_\"&Requirment[[#This Row],[Scenarios ]]&\"_\"&Requirment[[#This Row],[Nb phasis]]&\"_\"&Requirment[[#This Row],[Formula_Name]]","v":"___"},{"$f":"Requirment[[#This Row],[Production]]&\"_\"&Requirment[[#This Row],[Scenarios ]]&\"_\"&Requirment[[#This Row],[Nb phasis]]","v":"__"}]
[{"$f":"Requirment[[#This Row],[Production]]&\"_\"&Requirment[[#This Row],[Scenarios ]]&\"_\"&Requirment[[#This Row],[Nb phasis]]&\"_\"&Requirment[[#This Row],[Formula_Name]]","v":"___"},{"$f":"Requirment[[#This Row],[Production]]&\"_\"&Requirment[[#This Row],[Scenarios ]]&\"_\"&Requirment[[#This Row],[Nb phasis]]","v":"__"}]
[{"$f":"Requirment[[#This Row],[Production]]&\"_\"&Requirment[[#This Row],[Scenarios ]]&\"_\"&Requirment[[#This Row],[Nb phasis]]&\"_\"&Requirment[[#This Row],[Formula_Name]]","v":"___"},{"$f":"Requirment[[#This Row],[Production]]&\"_\"&Requirment[[#This Row],[Scenarios ]]&\"_\"&Requirment[[#This Row],[Nb phasis]]","v":"__"}]
[{"$f":"Requirment[[#This Row],[Production]]&\"_\"&Requirment[[#This Row],[Scenarios ]]&\"_\"&Requirment[[#This Row],[Nb phasis]]&\"_\"&Requirment[[#This Row],[Formula_Name]]","v":"___"},{"$f":"Requirment[[#This Row],[Production]]&\"_\"&Requirment[[#This Row],[Scenarios ]]&\"_\"&Requirment[[#This Row],[Nb phasis]]","v":"__"}]
[{"$f":"Requirment[[#This Row],[Production]]&\"_\"&Requirment[[#This Row],[Scenarios ]]&\"_\"&Requirment[[#This Row],[Nb phasis]]&\"_\"&Requirment[[#This Row],[Formula_Name]]","v":"___"},{"$f":"Requirment[[#This Row],[Production]]&\"_\"&Requirment[[#This Row],[Scenarios ]]&\"_\"&Requirment[[#This Row],[Nb phasis]]","v":"__"}]
[{"$f":"Requirment[[#This Row],[Production]]&\"_\"&Requirment[[#This Row],[Scenarios ]]&\"_\"&Requirment[[#This Row],[Nb phasis]]&\"_\"&Requirment[[#This Row],[Formula_Name]]","v":"___"},{"$f":"Requirment[[#This Row],[Production]]&\"_\"&Requirment[[#This Row],[Scenarios ]]&\"_\"&Requirment[[#This Row],[Nb phasis]]","v":"__"}]
[{"$f":"Requirment[[#This Row],[Production]]&\"_\"&Requirment[[#This Row],[Scenarios ]]&\"_\"&Requirment[[#This Row],[Nb phasis]]&\"_\"&Requirment[[#This Row],[Formula_Name]]","v":"___"},{"$f":"Requirment[[#This Row],[Production]]&\"_\"&Requirment[[#This Row],[Scenarios ]]&\"_\"&Requirment[[#This Row],[Nb phasis]]","v":"__"}]
[{"$f":"Requirment[[#This Row],[Production]]&\"_\"&Requirment[[#This Row],[Scenarios ]]&\"_\"&Requirment[[#This Row],[Nb phasis]]&\"_\"&Requirment[[#This Row],[Formula_Name]]","v":"___"},{"$f":"Requirment[[#This Row],[Production]]&\"_\"&Requirment[[#This Row],[Scenarios ]]&\"_\"&Requirment[[#This Row],[Nb phasis]]","v":"__"}]
[{"$f":"Requirment[[#This Row],[Production]]&\"_\"&Requirment[[#This Row],[Scenarios ]]&\"_\"&Requirment[[#This Row],[Nb phasis]]&\"_\"&Requirment[[#This Row],[Formula_Name]]","v":"___"},{"$f":"Requirment[[#This Row],[Production]]&\"_\"&Requirment[[#This Row],[Scenarios ]]&\"_\"&Requirment[[#This Row],[Nb phasis]]","v":"__"}]
[{"$f":"Requirment[[#This Row],[Production]]&\"_\"&Requirment[[#This Row],[Scenarios ]]&\"_\"&Requirment[[#This Row],[Nb phasis]]&\"_\"&Requirment[[#This Row],[Formula_Name]]","v":"___"},{"$f":"Requirment[[#This Row],[Production]]&\"_\"&Requirment[[#This Row],[Scenarios ]]&\"_\"&Requirment[[#This Row],[Nb phasis]]","v":"__"}]
[{"$f":"Requirment[[#This Row],[Production]]&\"_\"&Requirment[[#This Row],[Scenarios ]]&\"_\"&Requirment[[#This Row],[Nb phasis]]&\"_\"&Requirment[[#This Row],[Formula_Name]]","v":"___"},{"$f":"Requirment[[#This Row],[Production]]&\"_\"&Requirment[[#This Row],[Scenarios ]]&\"_\"&Requirment[[#This Row],[Nb phasis]]","v":"__"}]
[{"$f":"Requirment[[#This Row],[Production]]&\"_\"&Requirment[[#This Row],[Scenarios ]]&\"_\"&Requirment[[#This Row],[Nb phasis]]&\"_\"&Requirment[[#This Row],[Formula_Name]]","v":"___"},{"$f":"Requirment[[#This Row],[Production]]&\"_\"&Requirment[[#This Row],[Scenarios ]]&\"_\"&Requirment[[#This Row],[Nb phasis]]","v":"__"}]
[{"$f":"Requirment[[#This Row],[Production]]&\"_\"&Requirment[[#This Row],[Scenarios ]]&\"_\"&Requirment[[#This Row],[Nb phasis]]&\"_\"&Requirment[[#This Row],[Formula_Name]]","v":"___"},{"$f":"Requirment[[#This Row],[Production]]&\"_\"&Requirment[[#This Row],[Scenarios ]]&\"_\"&Requirment[[#This Row],[Nb phasis]]","v":"__"}]
[{"$f":"Requirment[[#This Row],[Production]]&\"_\"&Requirment[[#This Row],[Scenarios ]]&\"_\"&Requirment[[#This Row],[Nb phasis]]&\"_\"&Requirment[[#This Row],[Formula_Name]]","v":"___"},{"$f":"Requirment[[#This Row],[Production]]&\"_\"&Requirment[[#This Row],[Scenarios ]]&\"_\"&Requirment[[#This Row],[Nb phasis]]","v":"__"}]
[{"$f":"Requirment[[#This Row],[Production]]&\"_\"&Requirment[[#This Row],[Scenarios ]]&\"_\"&Requirment[[#This Row],[Nb phasis]]&\"_\"&Requirment[[#This Row],[Formula_Name]]","v":"___"},{"$f":"Requirment[[#This Row],[Production]]&\"_\"&Requirment[[#This Row],[Scenarios ]]&\"_\"&Requirment[[#This Row],[Nb phasis]]","v":"__"}]
[{"$f":"Requirment[[#This Row],[Production]]&\"_\"&Requirment[[#This Row],[Scenarios ]]&\"_\"&Requirment[[#This Row],[Nb phasis]]&\"_\"&Requirment[[#This Row],[Formula_Name]]","v":"___"},{"$f":"Requirment[[#This Row],[Production]]&\"_\"&Requirment[[#This Row],[Scenarios ]]&\"_\"&Requirment[[#This Row],[Nb phasis]]","v":"__"}]
[{"$f":"Requirment[[#This Row],[Production]]&\"_\"&Requirment[[#This Row],[Scenarios ]]&\"_\"&Requirment[[#This Row],[Nb phasis]]&\"_\"&Requirment[[#This Row],[Formula_Name]]","v":"___"},{"$f":"Requirment[[#This Row],[Production]]&\"_\"&Requirment[[#This Row],[Scenarios ]]&\"_\"&Requirment[[#This Row],[Nb phasis]]","v":"__"}]
[{"$f":"Requirment[[#This Row],[Production]]&\"_\"&Requirment[[#This Row],[Scenarios ]]&\"_\"&Requirment[[#This Row],[Nb phasis]]&\"_\"&Requirment[[#This Row],[Formula_Name]]","v":"___"},{"$f":"Requirment[[#This Row],[Production]]&\"_\"&Requirment[[#This Row],[Scenarios ]]&\"_\"&Requirment[[#This Row],[Nb phasis]]","v":"__"}]
[{"$f":"Requirment[[#This Row],[Production]]&\"_\"&Requirment[[#This Row],[Scenarios ]]&\"_\"&Requirment[[#This Row],[Nb phasis]]&\"_\"&Requirment[[#This Row],[Formula_Name]]","v":"___"},{"$f":"Requirment[[#This Row],[Production]]&\"_\"&Requirment[[#This Row],[Scenarios ]]&\"_\"&Requirment[[#This Row],[Nb phasis]]","v":"__"}]
[{"$f":"Requirment[[#This Row],[Production]]&\"_\"&Requirment[[#This Row],[Scenarios ]]&\"_\"&Requirment[[#This Row],[Nb phasis]]&\"_\"&Requirment[[#This Row],[Formula_Name]]","v":"___"},{"$f":"Requirment[[#This Row],[Production]]&\"_\"&Requirment[[#This Row],[Scenarios ]]&\"_\"&Requirment[[#This Row],[Nb phasis]]","v":"__"}]
[{"$f":"Requirment[[#This Row],[Production]]&\"_\"&Requirment[[#This Row],[Scenarios ]]&\"_\"&Requirment[[#This Row],[Nb phasis]]&\"_\"&Requirment[[#This Row],[Formula_Name]]","v":"___"},{"$f":"Requirment[[#This Row],[Production]]&\"_\"&Requirment[[#This Row],[Scenarios ]]&\"_\"&Requirment[[#This Row],[Nb phasis]]","v":"__"}]
[{"$f":"Requirment[[#This Row],[Production]]&\"_\"&Requirment[[#This Row],[Scenarios ]]&\"_\"&Requirment[[#This Row],[Nb phasis]]&\"_\"&Requirment[[#This Row],[Formula_Name]]","v":"___"},{"$f":"Requirment[[#This Row],[Production]]&\"_\"&Requirment[[#This Row],[Scenarios ]]&\"_\"&Requirment[[#This Row],[Nb phasis]]","v":"__"}]
[{"$f":"Requirment[[#This Row],[Production]]&\"_\"&Requirment[[#This Row],[Scenarios ]]&\"_\"&Requirment[[#This Row],[Nb phasis]]&\"_\"&Requirment[[#This Row],[Formula_Name]]","v":"___"},{"$f":"Requirment[[#This Row],[Production]]&\"_\"&Requirment[[#This Row],[Scenarios ]]&\"_\"&Requirment[[#This Row],[Nb phasis]]","v":"__"}]
[{"$f":"Requirment[[#This Row],[Production]]&\"_\"&Requirment[[#This Row],[Scenarios ]]&\"_\"&Requirment[[#This Row],[Nb phasis]]&\"_\"&Requirment[[#This Row],[Formula_Name]]","v":"___"},{"$f":"Requirment[[#This Row],[Production]]&\"_\"&Requirment[[#This Row],[Scenarios ]]&\"_\"&Requirment[[#This Row],[Nb phasis]]","v":"__"}]
[{"$f":"Requirment[[#This Row],[Production]]&\"_\"&Requirment[[#This Row],[Scenarios ]]&\"_\"&Requirment[[#This Row],[Nb phasis]]&\"_\"&Requirment[[#This Row],[Formula_Name]]","v":"___"},{"$f":"Requirment[[#This Row],[Production]]&\"_\"&Requirment[[#This Row],[Scenarios ]]&\"_\"&Requirment[[#This Row],[Nb phasis]]","v":"__"}]
[{"$f":"Requirment[[#This Row],[Production]]&\"_\"&Requirment[[#This Row],[Scenarios ]]&\"_\"&Requirment[[#This Row],[Nb phasis]]&\"_\"&Requirment[[#This Row],[Formula_Name]]","v":"___"},{"$f":"Requirment[[#This Row],[Production]]&\"_\"&Requirment[[#This Row],[Scenarios ]]&\"_\"&Requirment[[#This Row],[Nb phasis]]","v":"__"}]
[{"$f":"Requirment[[#This Row],[Production]]&\"_\"&Requirment[[#This Row],[Scenarios ]]&\"_\"&Requirment[[#This Row],[Nb phasis]]&\"_\"&Requirment[[#This Row],[Formula_Name]]","v":"___"},{"$f":"Requirment[[#This Row],[Production]]&\"_\"&Requirment[[#This Row],[Scenarios ]]&\"_\"&Requirment[[#This Row],[Nb phasis]]","v":"__"}]
[{"$f":"Requirment[[#This Row],[Production]]&\"_\"&Requirment[[#This Row],[Scenarios ]]&\"_\"&Requirment[[#This Row],[Nb phasis]]&\"_\"&Requirment[[#This Row],[Formula_Name]]","v":"___"},{"$f":"Requirment[[#This Row],[Production]]&\"_\"&Requirment[[#This Row],[Scenarios ]]&\"_\"&Requirment[[#This Row],[Nb phasis]]","v":"__"}]
[{"$f":"Requirment[[#This Row],[Production]]&\"_\"&Requirment[[#This Row],[Scenarios ]]&\"_\"&Requirment[[#This Row],[Nb phasis]]&\"_\"&Requirment[[#This Row],[Formula_Name]]","v":"___"},{"$f":"Requirment[[#This Row],[Production]]&\"_\"&Requirment[[#This Row],[Scenarios ]]&\"_\"&Requirment[[#This Row],[Nb phasis]]","v":"__"}]
[{"$f":"Requirment[[#This Row],[Production]]&\"_\"&Requirment[[#This Row],[Scenarios ]]&\"_\"&Requirment[[#This Row],[Nb phasis]]&\"_\"&Requirment[[#This Row],[Formula_Name]]","v":"___"},{"$f":"Requirment[[#This Row],[Production]]&\"_\"&Requirment[[#This Row],[Scenarios ]]&\"_\"&Requirment[[#This Row],[Nb phasis]]","v":"__"}]
[{"$f":"Requirment[[#This Row],[Production]]&\"_\"&Requirment[[#This Row],[Scenarios ]]&\"_\"&Requirment[[#This Row],[Nb phasis]]&\"_\"&Requirment[[#This Row],[Formula_Name]]","v":"___"},{"$f":"Requirment[[#This Row],[Production]]&\"_\"&Requirment[[#This Row],[Scenarios ]]&\"_\"&Requirment[[#This Row],[Nb phasis]]","v":"__"}]

{"sheet":"Roughage_Forage","index":4,"n_rows":31,"n_cols":42,"rows_kept":31,"merged":[[1,2,1,5],[1,11,1,13],[1,14,1,19],[2,2,2,5],[2,11,2,13],[2,14,2,19],[3,2,3,5],[3,11,3,13],[3,14,3,19],[4,2,4,5],[4,11,4,13],[4,14,4,19],[5,2,5,5],[5,11,5,13],[5,14,5,19],[6,2,6,5],[7,2,7,5],[8,2,8,5],[20,2,20,3],[21,2,21,3],[23,2,23,3],[25,2,25,3],[26,2,26,3],[27,2,27,3]]}
[]
["STEP 1 : Feeding scenario","Identity of the farm:","Example",{"$nulls":8},"Select the good scenario",null,null,"Broiler_2.6 kg alive at 98 days_3 feeds_3"]
[null,"Farmer's name:","Example",{"$nulls":8},"Feeding phase",null,null,"Finishing"]
[null,"Date:","2021-02-01",{"$nulls":3},{"$f":"TEXT(C4,\"aaaammjj\")","v":"20210201"},{"$nulls":4},"Duration",null,null,{"$f":"_xlfn.IFNA(VLOOKUP($O$9,Requirment[],7,FALSE),)","v":"63-98 day"}]
[null,"Production:","Broiler",{"$nulls":8},"This type of feed is used in",null,null,{"$f":"_xlfn.IFNA(VLOOKUP($O$9,Requirment[],8,FALSE),)","v":"France"}]
[null,"Poultry Flocks",15,{"$nulls":8},"Category of animals",null,null,{"$f":"_xlfn.IFNA(VLOOKUP($O$9,Requirment[],9,FALSE),)","v":"broiler"}]
[null,"Objectives (kg, days)","2.5 Kg in 100 days"]
[null,"Number of  feed phases ",3]
[null,"Type of animals","Broiler",{"$nulls":11},{"$f":"O2&\"_\"&O3","v":"Broiler_2.6 kg alive at 98 days_3 feeds_3_Finishing"}]
[]
["STEP 2 : Roughage/forage intake and nutritionnal value","Forage","Intake \n(Kg Fresh)","DM  (%)","ME roaster MJ/Kg","CP % ","Fat % ","Fiber % ","LYS %","MET % ","MET+CYS %","THR % ","TRY % ","DIS LYS poultry % ","DIS MET poultry % ","DIS MET+CYS poultry % ","DIS THR poultry % raw","DIS TRY poultry % raw","Ca g/kg Raw","P g/kg Raw","Na g/kg Raw"]
[null,"Red clover silage",0.01,0.35,{"v":13.6,"d":"13.60"},{"$f":"F18/E18*E12","v":{"v":17.10736842105263,"d":"17.11"}},{"$f":"3.1/0.274","v":{"v":11.313868613138686,"d":"11.31"}},{"v":10,"d":"10.00"},{"v":0,"d":"0.00"},{"v":0,"d":"0.00"},{"v":0,"d":"0.00"},{"v":0,"d":"0.00"},{"v":0,"d":"0.00"},{"v":0,"d":"0.00"},0.61,0.27,0.21,{"v":0,"d":"0.00"},0.06,{"v":0,"d":"0.00"},{"v":0,"d":"0.00"}]
[null,"Ex: List",{"v":0,"d":"0.00"},{"v":0,"d":"0.00"},{"v":0,"d":"0.00"},{"v":0,"d":"0.00"},{"v":0,"d":"0.00"},{"v":0,"d":"0.00"},{"v":0,"d":"0.00"},{"v":0,"d":"0.00"},{"v":0,"d":"0.00"},{"v":0,"d":"0.00"},{"v":0,"d":"0.00"},{"v":0,"d":"0.00"},{"v":0,"d":"0.00"},{"v":0,"d":"0.00"},{"v":0,"d":"0.00"},{"v":0,"d":"0.00"},{"v":0,"d":"0.00"},{"v":0,"d":"0.00"},{"v":0,"d":"0.00"}]
[]
[null,"TOTAL FORAGE",{"$f":"SUM(C12:C13)","v":0.01},null,{"$f":"SUMPRODUCT($C$12:$C$13*$D$12:$D$13*E12:E13)","v":{"v":0.047599999999999996,"d":"0.05"}},{"$f":"SUMPRODUCT($C$12:$C$13*$D$12:$D$13*F12:F13)","v":{"v":0.0598757894736842,"d":"0.06"}},{"$f":"SUMPRODUCT($C$12:$C$13*$D$12:$D$13*G12:G13)","v":{"v":0.0395985401459854,"d":"0.04"}},{"$f":"SUMPRODUCT($C$12:$C$13*$D$12:$D$13*H12:H13)","v":{"v":0.034999999999999996,"d":"0.04"}},{"$f":"SUMPRODUCT($C$12:$C$13*$D$12:$D$13*I12:I13)","v":{"v":0,"d":"0.00"}},{"$f":"SUMPRODUCT($C$12:$C$13*$D$12:$D$13*J12:J13)","v":{"v":0,"d":"0.00"}},{"$f":"SUMPRODUCT($C$12:$C$13*$D$12:$D$13*K12:K13)","v":{"v":0,"d":"0.00"}},{"$f":"SUMPRODUCT($C$12:$C$13*$D$12:$D$13*L12:L13)","v":{"v":0,"d":"0.00"}},{"$f":"SUMPRODUCT($C$12:$C$13*$D$12:$D$13*M12:M13)","v":{"v":0,"d":"0.00"}},{"$f":"SUMPRODUCT($C$12:$C$13*$D$12:$D$13*N12:N13)","v":{"v":0,"d":"0.00"}},{"$f":"SUMPRODUCT($C$12:$C$13*$D$12:$D$13*O12:O13)","v":{"v":2.1349999999999997E-3,"d":"0.00"}},{"$f":"SUMPRODUCT($C$12:$C$13*$D$12:$D$13*P12:P13)","v":{"v":0.000945,"d":"0.00"}},{"$f":"SUMPRODUCT($C$12:$C$13*$D$12:$D$13*Q12:Q13)","v":{"v":7.3499999999999987E-4,"d":"0.00"}},{"$f":"SUMPRODUCT($C$12:$C$13*$D$12:$D$13*R12:R13)","v":{"v":0,"d":"0.00"}},{"$f":"SUMPRODUCT($C$12:$C$13*$D$12:$D$13*S12:S13)","v":{"v":2.0999999999999998E-4,"d":"0.00"}},{"$f":"SUMPRODUCT($C$12:$C$13*$D$12:$D$13*T12:T13)","v":{"v":0,"d":"0.00"}},{"$f":"SUMPRODUCT($C$12:$C$13*$D$12:$D$13*U12:U13)","v":{"v":0,"d":"0.00"}}]
[]
["STEP 3 : Animal needs and classical ration planning",{"$nulls":3},"ME roaster MJ/Kg","CP % ","Fat % ","Fiber % ","LYS %","MET % ","MET+CYS %","THR % ","TRY % ","DIS LYS poultry % ","DIS MET poultry % ","DIS MET+CYS poultry % ","DIS THR poultry % raw","DIS TRY poultry % raw","Ca g/kg Raw","P g/kg Raw","Na g/kg Raw"]
[{"$nulls":3},"Min",{"$f":"_xlfn.IFNA(VLOOKUP($O$9,Requirment[],10,FALSE),\" \")","v":{"v":11.92468619246862,"d":"11.92"}},{"$f":"_xlfn.IFNA(VLOOKUP($O$9,Requirment[],11,FALSE),\" \")","v":{"v":15,"d":"15.00"}},{"$f":"_xlfn.IFNA(VLOOKUP($O$9,Requirment[],12,FALSE),\" \")","v":{"v":2,"d":"2.00"}},{"$f":"_xlfn.IFNA(VLOOKUP($O$9,Requirment[],13,FALSE),\" \")","v":{"v":0,"d":"0.00"}},{"$f":"_xlfn.IFNA(VLOOKUP($O$9,Requirment[],17,FALSE),\" \")","v":{"v":0.7215007215007214,"d":"0.72"}},{"$f":"_xlfn.IFNA(VLOOKUP($O$9,Requirment[],19,FALSE),\" \")","v":{"v":0.3108003108003108,"d":"0.31"}},{"$f":"_xlfn.IFNA(VLOOKUP($O$9,Requirment[],21,FALSE),\" \")","v":{"v":0.5772005772005772,"d":"0.58"}},{"$f":"_xlfn.IFNA(VLOOKUP($O$9,Requirment[],23,FALSE),\" \")","v":{"v":0.45510045510045505,"d":"0.46"}},{"$f":"_xlfn.IFNA(VLOOKUP($O$9,Requirment[],25,FALSE),\" \")","v":{"v":0.1554001554001554,"d":"0.16"}},{"$f":"_xlfn.IFNA(VLOOKUP($O$9,Requirment[],18,FALSE),\" \")","v":0.65},{"$f":"_xlfn.IFNA(VLOOKUP($O$9,Requirment[],20,FALSE),\" \")","v":0.28},{"$f":"_xlfn.IFNA(VLOOKUP($O$9,Requirment[],22,FALSE),\" \")","v":0.52},{"$f":"_xlfn.IFNA(VLOOKUP($O$9,Requirment[],20,FALSE),\" \")","v":0.28},{"$f":"_xlfn.IFNA(VLOOKUP($O$9,Requirment[],26,FALSE),\" \")","v":0.14},{"$f":"_xlfn.IFNA(VLOOKUP($O$9,Requirment[],14,FALSE),\" \")","v":{"v":0.7,"d":"0.70"}},{"$f":"_xlfn.IFNA(VLOOKUP($O$9,Requirment[],15,FALSE),\" \")","v":{"v":0.3,"d":"0.30"}},{"$f":"_xlfn.IFNA(VLOOKUP($O$9,Requirment[],16,FALSE),\" \")","v":0.15}]
[{"$nulls":3},"Max",{"$f":"_xlfn.IFNA(VLOOKUP($O$9,Requirment[],27,FALSE),\" \")","v":{"v":12.343096234309623,"d":"12.34"}},{"$f":"_xlfn.IFNA(VLOOKUP($O$9,Requirment[],28,FALSE),\" \")","v":{"v":17,"d":"17.00"}},{"$f":"_xlfn.IFNA(VLOOKUP($O$9,Requirment[],29,FALSE),\" \")","v":{"v":7,"d":"7.00"}},{"$f":"_xlfn.IFNA(VLOOKUP($O$9,Requirment[],30,FALSE),\" \")","v":{"v":7,"d":"7.00"}},{"$f":"_xlfn.IFNA(VLOOKUP($O$9,Requirment[],34,FALSE),\" \")","v":{"v":0.8325008325008325,"d":"0.83"}},{"$f":"_xlfn.IFNA(VLOOKUP($O$9,Requirment[],36,FALSE),\" \")","v":{"v":0.4218004218004218,"d":"0.42"}},{"$f":"_xlfn.IFNA(VLOOKUP($O$9,Requirment[],38,FALSE),\" \")","v":{"v":0.6882006882006882,"d":"0.69"}},{"$f":"_xlfn.IFNA(VLOOKUP($O$9,Requirment[],40,FALSE),\" \")","v":{"v":0.6771006771006771,"d":"0.68"}},{"$f":"_xlfn.IFNA(VLOOKUP($O$9,Requirment[],42,FALSE),\" \")","v":{"v":0.3774003774003774,"d":"0.38"}},{"$f":"_xlfn.IFNA(VLOOKUP($O$9,Requirment[],35,FALSE),\" \")","v":0.75},{"$f":"_xlfn.IFNA(VLOOKUP($O$9,Requirment[],37,FALSE),\" \")","v":0.38},{"$f":"_xlfn.IFNA(VLOOKUP($O$9,Requirment[],39,FALSE),\" \")","v":0.62},{"$f":"_xlfn.IFNA(VLOOKUP($O$9,Requirment[],41,FALSE),\" \")","v":0.61},{"$f":"_xlfn.IFNA(VLOOKUP($O$9,Requirment[],43,FALSE),\" \")","v":0.34},{"$f":"_xlfn.IFNA(VLOOKUP($O$9,Requirment[],31,FALSE),\" \")","v":{"v":0.9,"d":"0.90"}},{"$f":"_xlfn.IFNA(VLOOKUP($O$9,Requirment[],15,FALSE),\" \")","v":{"v":0.3,"d":"0.30"}},{"$f":"_xlfn.IFNA(VLOOKUP($O$9,Requirment[],33,FALSE),\" \")","v":0.18}]
[]
[null,"Kg concentrate/day","Needs",null,"ME roaster MJ/Kg","CP % ","Fat % ","Fiber % ","LYS %","MET % ","MET+CYS %","THR % ","TRY % ","DIS LYS poultry % ","DIS MET poultry % ","DIS MET+CYS poultry % ","DIS THR poultry % raw","DIS TRY poultry % raw","Ca g/kg Raw","P g/kg Raw","Na g/kg Raw"]
[null,{"v":0.1,"d":"0.10"},"Objective",null,{"$f":"AVERAGE(E18:E19)","v":{"v":12.133891213389122,"d":"12.13"}},{"v":16,"d":"16.00"},{"v":4.5,"d":"4.50"},{"v":3.5,"d":"3.50"},{"v":0.777000777000777,"d":"0.78"},{"v":0.36630036630036633,"d":"0.37"},{"v":0.6327006327006327,"d":"0.63"},{"v":0.566100566100566,"d":"0.57"},{"v":0.2664002664002664,"d":"0.27"},{"v":0.7,"d":"0.70"},0.33,{"v":0.5700000000000001,"d":"0.57"},{"v":0.445,"d":"0.45"},{"v":0.24000000000000002,"d":"0.24"},{"v":0.8,"d":"0.80"},{"v":0.3,"d":"0.30"},{"v":0.16499999999999998,"d":"0.17"}]
[null,{"$f":"B22*1000","v":100}]
[null,"Grams","TOTAL NEEDS",null,{"$f":"E22*$B$22","v":{"v":1.2133891213389123,"d":"1.21"}},{"v":1.6,"d":"1.60"},0.45,{"v":0.35000000000000003,"d":"0.35"},{"v":0.0777000777000777,"d":"0.08"},{"v":0.03663003663003663,"d":"0.04"},{"v":0.06327006327006328,"d":"0.06"},{"v":0.05661005661005661,"d":"0.06"},{"v":0.02664002664002664,"d":"0.03"},{"v":0.06999999999999999,"d":"0.07"},{"v":0.033,"d":"0.03"},{"v":0.05700000000000001,"d":"0.06"},{"v":0.044500000000000005,"d":"0.04"},{"v":0.024000000000000004,"d":"0.02"},{"v":0.08000000000000002,"d":"0.08"},0.03,{"v":0.016499999999999997,"d":"0.02"}]
[]
["STEP 4 : Animal needs cover by concentrate",{"$nulls":3},"ME roaster MJ/Kg","CP % ","Fat % ","Fiber % ","LYS %","MET % ","MET+CYS %","THR % ","TRY % ","DIS LYS poultry % ","DIS MET poultry % ","DIS MET+CYS poultry % ","DIS THR poultry % raw","DIS TRY poultry % raw","Ca g/kg Raw","P g/kg Raw","Na g/kg Raw"]
[null,"TOTAL needs cover by concentrate (TOTAL NEEDS - FORAGE INTAKE)","Kg",null,{"$f":"E24-E15","v":{"v":1.1657891213389122,"d":"1.17"}},{"v":1.540124210526316,"d":"1.54"},{"v":0.4104014598540146,"d":"0.41"},{"v":0.31500000000000006,"d":"0.32"},{"v":0.0777000777000777,"d":"0.08"},{"v":0.03663003663003663,"d":"0.04"},{"v":0.06327006327006328,"d":"0.06"},{"v":0.05661005661005661,"d":"0.06"},{"v":0.02664002664002664,"d":"0.03"},{"v":0.06999999999999999,"d":"0.07"},{"v":0.030865000000000004,"d":"0.03"},{"v":0.05605500000000001,"d":"0.06"},{"v":0.043765000000000005,"d":"0.04"},{"v":0.024000000000000004,"d":"0.02"},{"v":0.07979000000000001,"d":"0.08"},0.03,{"v":0.016499999999999997,"d":"0.02"}]
[null,"Objective TOTAL needs/Kg of concentrate",0.09,null,{"$f":"E27/$C$28","v":{"v":12.953212459321247,"d":"12.95"}},{"$f":"F27/$C$28","v":{"v":17.11249122807018,"d":"17.11"}},{"v":4.560016220600162,"d":"4.56"},{"v":3.500000000000001,"d":"3.50"},{"v":0.86333419666753,"d":"0.86"},{"$f":"J27/$C$28","v":{"v":0.407000407000407,"d":"0.41"}},{"v":0.7030007030007032,"d":"0.70"},{"v":0.629000629000629,"d":"0.63"},{"v":0.29600029600029604,"d":"0.30"},{"v":0.7777777777777777,"d":"0.78"},{"v":0.3429444444444445,"d":"0.34"},{"v":0.6228333333333335,"d":"0.62"},{"v":0.48627777777777786,"d":"0.49"},{"v":0.2666666666666667,"d":"0.27"},{"v":0.8865555555555558,"d":"0.89"},{"v":0.3333333333333333,"d":"0.33"},{"v":0.18333333333333332,"d":"0.18"}]
[]
["STEP 5 : Nutritional recommandation for concentrate","Production","Scenarios ","Nb phasis","Formula_Name","Duration","Country","Type of animals to select ration limitation levels","F1_ME Min","F1_CP Min","F1_FAT Min","F1_CF Min","F1_Ca Min","F1_P Min","F1_Na Min","F1 Lys tot min","F1_Lys DIS min","F1_Met tot Max","F1_Met DIS Min","F1_Met+Cys Tot Min","F1_Met+Cys DIS Min","F1_Thr tot Min","F1_Thr DIS Min","F1_try tot Min","F1_try DIS Min","F1_ME Max","F1_CP Max","F1_FAT Max","F1_CF Max","F1_Ca Max","F1_P Max","F1_Na Max","F1_Lys Tot Max ","F1_Lys DIS Max","F1_Met Tot Max2","F1_Met DIS Max","F1_Met+Cys Tot max","F1_Met+Cys DIS Max","F1_Thr tot Max","F1_Thr Max","F1_try tot Max","F1_try DIS Max"]
["Copy",{"$f":"C5","v":"Broiler"},{"$f":"CONCATENATE(O2,\"_\",O3,\"_\",B12)","v":"Broiler_2.6 kg alive at 98 days_3 feeds_3_Finishing_Red clover silage"},{"$f":"C8","v":3},{"$f":"O3","v":"Finishing"},{"$f":"O4","v":"63-98 day"},{"$f":"O5","v":"France"},{"$f":"O6","v":"broiler"},{"$f":"E28","v":{"v":12.953212459321247,"d":"12.95"}},{"$f":"F28","v":{"v":17.11249122807018,"d":"17.11"}},{"$f":"G28","v":{"v":4.560016220600162,"d":"4.56"}},{"v":3.500000000000001,"d":"3.50"},{"v":0.86333419666753,"d":"0.86"},{"v":0.407000407000407,"d":"0.41"},{"v":0.7030007030007032,"d":"0.70"},{"v":0.629000629000629,"d":"0.63"},{"v":0.29600029600029604,"d":"0.30"},{"v":0.7777777777777777,"d":"0.78"},{"v":0.3429444444444445,"d":"0.34"},{"v":0.6228333333333335,"d":"0.62"},{"v":0.48627777777777786,"d":"0.49"},{"v":0.2666666666666667,"d":"0.27"},{"v":0.8865555555555558,"d":"0.89"},{"v":0.3333333333333333,"d":"0.33"},{"v":0.18333333333333332,"d":"0.18"},{"v":0,"d":"0.00"},{"v":0,"d":"0.00"},{"v":0,"d":"0.00"},{"v":0,"d":"0.00"},{"v":0,"d":"0.00"},{"v":0,"d":"0.00"},{"v":0,"d":"0.00"},{"v":0,"d":"0.00"},{"v":0,"d":"0.00"},{"v":0,"d":"0.00"},{"v":0,"d":"0.00"},{"v":0,"d":"0.00"},{"v":0,"d":"0.00"},{"v":0,"d":"0.00"},{"v":0,"d":"0.00"},{"v":0,"d":"0.00"},{"v":0,"d":"0.00"}]

{"sheet":"PDF_Export","index":5,"n_rows":53,"n_cols":6,"rows_kept":53}
[{"$f":"CONCATENATE(\"RATION REALIZED ON: \"&TEXT(Tool!E5,\"jj/mm/aaaa\"))","v":"RATION REALIZED ON: 00/01/1900"}]
[]
["Context:"]
[{"$f":"Tool!D3","v":"Identity of the farm:"},{"$f":"IF(Tool!E3<>\"\",Tool!E3,\"\")","v":""}]
[{"$f":"Tool!D4","v":"Farmer's name:"},{"$f":"IF(Tool!E4<>\"\",Tool!E4,\"\")","v":""}]
[{"$f":"Tool!D6","v":"Production:"},{"$f":"IF(Tool!E6<>\"\",Tool!E6,\"\")","v":""}]
[{"$f":"Tool!D7","v":"Poultry Flocks"},{"$f":"IF(Tool!E7<>\"\",Tool!E7,\"\")","v":""}]
[{"$f":"Tool!D8","v":"Objectives (kg, days)"},{"$f":"IF(Tool!E8<>\"\",Tool!E8,\"\")","v":""}]
[{"$f":"Tool!D9","v":"Number of  feed phases "},{"$f":"IF(Tool!E9<>\"\",Tool!E9,\"\")","v":""}]
[{"$f":"Tool!D10","v":"Type of animals"},{"$f":"IF(Tool!E10<>\"\",Tool!E10,\"\")","v":""}]
[]
["Scenario selected:"]
["Tool scenario:",{"$f":"Tool!L3&\"_\"&Tool!L4","v":"Broiler_Broiler_2.6 kg alive at 98 days_3 feeds_3_Finishing_Red clover silage_3_Finishing"}]
[]
["Feedstuff composition:",{"$f":"Tool!E11","v":0},"Kg"]
[]
[null,"%","Kg","% cost","Cost (€/T)"]
[{"$f":"IF(Tool!D14<>\"\",IF(Tool!F14<>0,Tool!D14,\"\"),\"\")","v":""},{"$f":"IF(Tool!F14<>\"\",IF(Tool!F14<>0,Tool!F14,\"\"))","v":""},{"$f":"IF(Tool!E14<>\"\",IF(Tool!E14<>0,Tool!E14,\"\"))","v":""},{"$f":"IF(A18<>\"\",Tool!AE14,\"\")","v":""},{"$f":"IF(A18<>\"\",Tool!AC14,\"\")","v":""},{"$f":"IF(E18<>\"\",\"/Tonne\",\"\")","v":""}]
[{"$f":"IF(Tool!D15<>\"\",IF(Tool!F15<>0,Tool!D15,\"\"),\"\")","v":""},{"$f":"IF(Tool!F15<>\"\",IF(Tool!F15<>0,Tool!F15,\"\"))","v":""},{"$f":"IF(Tool!E15<>\"\",IF(Tool!E15<>0,Tool!E15,\"\"))","v":""},{"$f":"IF(A19<>\"\",Tool!AE15,\"\")","v":""},{"$f":"IF(A19<>\"\",Tool!AC15,\"\")","v":""},{"$f":"IF(E19<>\"\",\"/Tonne\",\"\")","v":""}]
[{"$f":"IF(Tool!D16<>\"\",IF(Tool!F16<>0,Tool!D16,\"\"),\"\")","v":""},{"$f":"IF(Tool!F16<>\"\",IF(Tool!F16<>0,Tool!F16,\"\"))","v":""},{"$f":"IF(Tool!E16<>\"\",IF(Tool!E16<>0,Tool!E16,\"\"))","v":""},{"$f":"IF(A20<>\"\",Tool!AE16,\"\")","v":""},{"$f":"IF(A20<>\"\",Tool!AC16,\"\")","v":""},{"$f":"IF(E20<>\"\",\"/Tonne\",\"\")","v":""}]
[{"$f":"IF(Tool!D17<>\"\",IF(Tool!F17<>0,Tool!D17,\"\"),\"\")","v":""},{"$f":"IF(Tool!F17<>\"\",IF(Tool!F17<>0,Tool!F17,\"\"))","v":""},{"$f":"IF(Tool!E17<>\"\",IF(Tool!E17<>0,Tool!E17,\"\"))","v":""},{"$f":"IF(A21<>\"\",Tool!AE17,\"\")","v":""},{"$f":"IF(A21<>\"\",Tool!AC17,\"\")","v":""},""]
[{"$f":"IF(Tool!D18<>\"\",IF(Tool!F18<>0,Tool!D18,\"\"),\"\")","v":""},{"$f":"IF(Tool!F18<>\"\",IF(Tool!F18<>0,Tool!F18,\"\"))","v":""},{"$f":"IF(Tool!E18<>\"\",IF(Tool!E18<>0,Tool!E18,\"\"))","v":""},{"$f":"IF(A22<>\"\",Tool!AE18,\"\")","v":""},{"$f":"IF(A22<>\"\",Tool!AC18,\"\")","v":""},""]
[{"$f":"IF(Tool!D19<>\"\",IF(Tool!F19<>0,Tool!D19,\"\"),\"\")","v":""},{"$f":"IF(Tool!F19<>\"\",IF(Tool!F19<>0,Tool!F19,\"\"))","v":""},{"$f":"IF(Tool!E19<>\"\",IF(Tool!E19<>0,Tool!E19,\"\"))","v":""},{"$f":"IF(A23<>\"\",Tool!AE19,\"\")","v":""},{"$f":"IF(A23<>\"\",Tool!AC19,\"\")","v":""},""]
[{"$f":"IF(Tool!D20<>\"\",IF(Tool!F20<>0,Tool!D20,\"\"),\"\")","v":""},{"$f":"IF(Tool!F20<>\"\",IF(Tool!F20<>0,Tool!F20,\"\"))","v":""},{"$f":"IF(Tool!E20<>\"\",IF(Tool!E20<>0,Tool!E20,\"\"))","v":""},{"$f":"IF(A24<>\"\",Tool!AE20,\"\")","v":""},{"$f":"IF(A24<>\"\",Tool!AC20,\"\")","v":""},""]
[{"$f":"IF(Tool!D21<>\"\",IF(Tool!F21<>0,Tool!D21,\"\"),\"\")","v":""},{"$f":"IF(Tool!F21<>\"\",IF(Tool!F21<>0,Tool!F21,\"\"))","v":""},{"$f":"IF(Tool!E21<>\"\",IF(Tool!E21<>0,Tool!E21,\"\"))","v":""},{"$f":"IF(A25<>\"\",Tool!AE21,\"\")","v":""},{"$f":"IF(A25<>\"\",Tool!AC21,\"\")","v":""},""]
[{"$f":"IF(Tool!D22<>\"\",IF(Tool!F22<>0,Tool!D22,\"\"),\"\")","v":""},{"$f":"IF(Tool!F22<>\"\",IF(Tool!F22<>0,Tool!F22,\"\"))","v":""},{"$f":"IF(Tool!E22<>\"\",IF(Tool!E22<>0,Tool!E22,\"\"))","v":""},{"$f":"IF(A26<>\"\",Tool!AE22,\"\")","v":""},{"$f":"IF(A26<>\"\",Tool!AC22,\"\")","v":""},""]
[{"$f":"IF(Tool!D23<>\"\",IF(Tool!F23<>0,Tool!D23,\"\"),\"\")","v":""},{"$f":"IF(Tool!F23<>\"\",IF(Tool!F23<>0,Tool!F23,\"\"))","v":""},{"$f":"IF(Tool!E23<>\"\",IF(Tool!E23<>0,Tool!E23,\"\"))","v":""},{"$f":"IF(A27<>\"\",Tool!AE23,\"\")","v":""},{"$f":"IF(A27<>\"\",Tool!AC23,\"\")","v":""},""]
[{"$f":"IF(Tool!D24<>\"\",IF(Tool!F24<>0,Tool!D24,\"\"),\"\")","v":""},{"$f":"IF(Tool!F24<>\"\",IF(Tool!F24<>0,Tool!F24,\"\"))","v":""},{"$f":"IF(Tool!E24<>\"\",IF(Tool!E24<>0,Tool!E24,\"\"))","v":""},{"$f":"IF(A28<>\"\",Tool!AE24,\"\")","v":""},{"$f":"IF(A28<>\"\",Tool!AC24,\"\")","v":""},""]
[{"$f":"IF(Tool!D25<>\"\",IF(Tool!F25<>0,Tool!D25,\"\"),\"\")","v":""},{"$f":"IF(Tool!F25<>\"\",IF(Tool!F25<>0,Tool!F25,\"\"))","v":""},{"$f":"IF(Tool!E25<>\"\",IF(Tool!E25<>0,Tool!E25,\"\"))","v":""},{"$f":"IF(A29<>\"\",Tool!AE25,\"\")","v":""},{"$f":"IF(A29<>\"\",Tool!AC25,\"\")","v":""},""]
[]
["Number of feedstuffs:",{"$f":"12-COUNTBLANK(A18:A29)","v":0}]
["Ration cost:",{"$f":"Tool!AD29","v":0},{"$f":"IF(B32<>\"\",\"/Tonne\",\"\")","v":"/Tonne"}]
[]
["Ration results:"]
[]
[null,"TOTAL",null,null,"Min","Max"]
["Metabolisable Energy",{"$f":"Tool!G27","v":{"v":0,"d":"0.00"}},"MJ/Kg",null,{"$f":"Tool!G30","v":{"v":12.953212459321247,"d":"12.95"}},{"$f":"Tool!G31","v":{"v":0,"d":"0.00"}}]
["Crude Protein",{"$f":"Tool!H27","v":{"v":0,"d":"0.00"}},"%",null,{"$f":"Tool!H30","v":{"v":17.11249122807018,"d":"17.11"}},{"$f":"Tool!H31","v":{"v":0,"d":"0.00"}}]
["FAT",{"$f":"Tool!I27","v":{"v":0,"d":"0.00"}},"%",null,{"$f":"Tool!I30","v":{"v":4.560016220600162,"d":"4.56"}},{"$f":"Tool!I31","v":{"v":0,"d":"0.00"}}]
["Fiber",{"$f":"Tool!J27","v":{"v":0,"d":"0.00"}},"%",null,{"$f":"Tool!J30","v":{"v":3.500000000000001,"d":"3.50"}},{"$f":"Tool!J31","v":{"v":0,"d":"0.00"}}]
["Lysin",{"$f":"Tool!K27","v":{"v":0,"d":"0.00"}},"%",null,{"$f":"Tool!K30","v":{"v":0.629000629000629,"d":"0.63"}},{"$f":"Tool!K31","v":{"v":0,"d":"0.00"}}]
["Methionine",{"$f":"Tool!L27","v":{"v":0,"d":"0.00"}},"%",null,{"$f":"Tool!L30","v":{"v":0.7777777777777777,"d":"0.78"}},{"$f":"Tool!L31","v":{"v":0,"d":"0.00"}}]
["Methionine+Cystine",{"$f":"Tool!M27","v":{"v":0,"d":"0.00"}},"%",null,{"$f":"Tool!M30","v":{"v":0.6228333333333335,"d":"0.62"}},{"$f":"Tool!M31","v":{"v":0,"d":"0.00"}}]
["Threonine",{"$f":"Tool!N27","v":{"v":0,"d":"0.00"}},"%",null,{"$f":"Tool!N30","v":{"v":0.2666666666666667,"d":"0.27"}},{"$f":"Tool!N31","v":{"v":0,"d":"0.00"}}]
["Thyptophan ",{"$f":"Tool!O27","v":{"v":0,"d":"0.00"}},"%",null,{"$f":"Tool!O30","v":{"v":0.3333333333333333,"d":"0.33"}},{"$f":"Tool!O31","v":{"v":0,"d":"0.00"}}]
["Lysin Digestible",{"$f":"Tool!P27","v":{"v":0,"d":"0.00"}},"%",null,{"$f":"Tool!P30","v":{"v":0.29600029600029604,"d":"0.30"}},{"$f":"Tool!P31","v":{"v":0,"d":"0.00"}}]
["Methionine Digestible",{"$f":"Tool!Q27","v":{"v":0,"d":"0.00"}},"%",null,{"$f":"Tool!Q30","v":{"v":0.3429444444444445,"d":"0.34"}},{"$f":"Tool!Q31","v":{"v":0,"d":"0.00"}}]
["Methionine+Cystine Digestible",{"$f":"Tool!R27","v":{"v":0,"d":"0.00"}},"%",null,{"$f":"Tool!R30","v":{"v":0.48627777777777786,"d":"0.49"}},{"$f":"Tool!R31","v":{"v":0,"d":"0.00"}}]
["Threonine Digestible",{"$f":"Tool!S27","v":{"v":0,"d":"0.00"}},"%",null,{"$f":"Tool!S30","v":{"v":0.3429444444444445,"d":"0.34"}},{"$f":"Tool!S31","v":{"v":0,"d":"0.00"}}]
["Tryptophan Digestible",{"$f":"Tool!T27","v":{"v":0,"d":"0.00"}},"%",null,{"$f":"Tool!T30","v":{"v":0.18333333333333332,"d":"0.18"}},{"$f":"Tool!T31","v":{"v":0,"d":"0.00"}}]
["Calcium",{"$f":"Tool!U27","v":{"v":0,"d":"0.00"}},"g/Kg",null,{"$f":"Tool!U30","v":{"v":0.86333419666753,"d":"0.86"}},{"$f":"Tool!U31","v":{"v":0,"d":"0.00"}}]
["Phosphorus",{"$f":"Tool!V27","v":{"v":0,"d":"0.00"}},"g/Kg",null,{"$f":"Tool!V30","v":{"v":0.407000407000407,"d":"0.41"}},{"$f":"Tool!V31","v":{"v":0.407000407000407,"d":"0.41"}}]
["Sodium",{"$f":"Tool!W27","v":{"v":0,"d":"0.00"}},"g/Kg",null,{"$f":"Tool!W30","v":{"v":0.7030007030007032,"d":"0.70"}},{"$f":"Tool!W31","v":{"v":0,"d":"0.00"}}]

{"sheet":"Contribution","index":6,"n_rows":14,"n_cols":8,"rows_kept":14,"hidden":true}
["Feedstuffs - ME","% of contribution off each feedstuff for Energy","Feedstuffs CP","% of contribution off each feedstuff for Proteins","Feedstuffs LYS","% of contribution off each feedstuff for Lysine","Feedstuffs MET","% of contribution off each feedstuff for Methionine"]
[{"$f":"IF(B2<>0,Tool!D14,\"\")","v":{"$error":"#DIV/0!"}},{"$f":"Tool!G14*Tool!F14/Tool!$G$27","v":{"$error":"#DIV/0!"}},{"$f":"IF(D2<>0,Tool!D14,\"\")","v":{"$error":"#DIV/0!"}},{"$f":"Tool!H14*Tool!F14/Tool!$H$27","v":{"$error":"#DIV/0!"}},{"$f":"IF(F2<>0,Tool!D14,\"\")","v":{"$error":"#DIV/0!"}},{"$f":"Tool!K14*Tool!F14/Tool!$K$27","v":{"$error":"#DIV/0!"}},{"$f":"IF(H2<>0,Tool!D14,\"\")","v":{"$error":"#DIV/0!"}},{"$f":"Tool!L14*Tool!F14/Tool!$L$27","v":{"$error":"#DIV/0!"}}]
[{"$f":"IF(B3<>0,Tool!D15,\"\")","v":{"$error":"#DIV/0!"}},{"$f":"Tool!G15*Tool!F15/Tool!$G$27","v":{"$error":"#DIV/0!"}},{"$f":"IF(D3<>0,Tool!D15,\"\")","v":{"$error":"#DIV/0!"}},{"$f":"Tool!H15*Tool!F15/Tool!$H$27","v":{"$error":"#DIV/0!"}},{"$f":"IF(F3<>0,Tool!D15,\"\")","v":{"$error":"#DIV/0!"}},{"$f":"Tool!K15*Tool!F15/Tool!$K$27","v":{"$error":"#DIV/0!"}},{"$f":"IF(H3<>0,Tool!D15,\"\")","v":{"$error":"#DIV/0!"}},{"$f":"Tool!L15*Tool!F15/Tool!$L$27","v":{"$error":"#DIV/0!"}}]
[{"$f":"IF(B4<>0,Tool!D16,\"\")","v":{"$error":"#DIV/0!"}},{"$f":"Tool!G16*Tool!F16/Tool!$G$27","v":{"$error":"#DIV/0!"}},{"$f":"IF(D4<>0,Tool!D16,\"\")","v":{"$error":"#DIV/0!"}},{"$f":"Tool!H16*Tool!F16/Tool!$H$27","v":{"$error":"#DIV/0!"}},{"$f":"IF(F4<>0,Tool!D16,\"\")","v":{"$error":"#DIV/0!"}},{"$f":"Tool!K16*Tool!F16/Tool!$K$27","v":{"$error":"#DIV/0!"}},{"$f":"IF(H4<>0,Tool!D16,\"\")","v":{"$error":"#DIV/0!"}},{"$f":"Tool!L16*Tool!F16/Tool!$L$27","v":{"$error":"#DIV/0!"}}]
[{"$f":"IF(B5<>0,Tool!D17,\"\")","v":{"$error":"#DIV/0!"}},{"$f":"Tool!G17*Tool!F17/Tool!$G$27","v":{"$error":"#DIV/0!"}},{"$f":"IF(D5<>0,Tool!D17,\"\")","v":{"$error":"#DIV/0!"}},{"$f":"Tool!H17*Tool!F17/Tool!$H$27","v":{"$error":"#DIV/0!"}},{"$f":"IF(F5<>0,Tool!D17,\"\")","v":{"$error":"#DIV/0!"}},{"$f":"Tool!K17*Tool!F17/Tool!$K$27","v":{"$error":"#DIV/0!"}},{"$f":"IF(H5<>0,Tool!D17,\"\")","v":{"$error":"#DIV/0!"}},{"$f":"Tool!L17*Tool!F17/Tool!$L$27","v":{"$error":"#DIV/0!"}}]
[{"$f":"IF(B6<>0,Tool!D18,\"\")","v":{"$error":"#DIV/0!"}},{"$f":"Tool!G18*Tool!F18/Tool!$G$27","v":{"$error":"#DIV/0!"}},{"$f":"IF(D6<>0,Tool!D18,\"\")","v":{"$error":"#DIV/0!"}},{"$f":"Tool!H18*Tool!F18/Tool!$H$27","v":{"$error":"#DIV/0!"}},{"$f":"IF(F6<>0,Tool!D18,\"\")","v":{"$error":"#DIV/0!"}},{"$f":"Tool!K18*Tool!F18/Tool!$K$27","v":{"$error":"#DIV/0!"}},{"$f":"IF(H6<>0,Tool!D18,\"\")","v":{"$error":"#DIV/0!"}},{"$f":"Tool!L18*Tool!F18/Tool!$L$27","v":{"$error":"#DIV/0!"}}]
[{"$f":"IF(B7<>0,Tool!D19,\"\")","v":{"$error":"#DIV/0!"}},{"$f":"Tool!G19*Tool!F19/Tool!$G$27","v":{"$error":"#DIV/0!"}},{"$f":"IF(D7<>0,Tool!D19,\"\")","v":{"$error":"#DIV/0!"}},{"$f":"Tool!H19*Tool!F19/Tool!$H$27","v":{"$error":"#DIV/0!"}},{"$f":"IF(F7<>0,Tool!D19,\"\")","v":{"$error":"#DIV/0!"}},{"$f":"Tool!K19*Tool!F19/Tool!$K$27","v":{"$error":"#DIV/0!"}},{"$f":"IF(H7<>0,Tool!D19,\"\")","v":{"$error":"#DIV/0!"}},{"$f":"Tool!L19*Tool!F19/Tool!$L$27","v":{"$error":"#DIV/0!"}}]
[{"$f":"IF(B8<>0,Tool!D20,\"\")","v":{"$error":"#DIV/0!"}},{"$f":"Tool!G20*Tool!F20/Tool!$G$27","v":{"$error":"#DIV/0!"}},{"$f":"IF(D8<>0,Tool!D20,\"\")","v":{"$error":"#DIV/0!"}},{"$f":"Tool!H20*Tool!F20/Tool!$H$27","v":{"$error":"#DIV/0!"}},{"$f":"IF(F8<>0,Tool!D20,\"\")","v":{"$error":"#DIV/0!"}},{"$f":"Tool!K20*Tool!F20/Tool!$K$27","v":{"$error":"#DIV/0!"}},{"$f":"IF(H8<>0,Tool!D20,\"\")","v":{"$error":"#DIV/0!"}},{"$f":"Tool!L20*Tool!F20/Tool!$L$27","v":{"$error":"#DIV/0!"}}]
[{"$f":"IF(B9<>0,Tool!D21,\"\")","v":{"$error":"#DIV/0!"}},{"$f":"Tool!G21*Tool!F21/Tool!$G$27","v":{"$error":"#DIV/0!"}},{"$f":"IF(D9<>0,Tool!D21,\"\")","v":{"$error":"#DIV/0!"}},{"$f":"Tool!H21*Tool!F21/Tool!$H$27","v":{"$error":"#DIV/0!"}},{"$f":"IF(F9<>0,Tool!D21,\"\")","v":{"$error":"#DIV/0!"}},{"$f":"Tool!K21*Tool!F21/Tool!$K$27","v":{"$error":"#DIV/0!"}},{"$f":"IF(H9<>0,Tool!D21,\"\")","v":{"$error":"#DIV/0!"}},{"$f":"Tool!L21*Tool!F21/Tool!$L$27","v":{"$error":"#DIV/0!"}}]
[{"$f":"IF(B10<>0,Tool!D22,\"\")","v":{"$error":"#DIV/0!"}},{"$f":"Tool!G22*Tool!F22/Tool!$G$27","v":{"$error":"#DIV/0!"}},{"$f":"IF(D10<>0,Tool!D22,\"\")","v":{"$error":"#DIV/0!"}},{"$f":"Tool!H22*Tool!F22/Tool!$H$27","v":{"$error":"#DIV/0!"}},{"$f":"IF(F10<>0,Tool!D22,\"\")","v":{"$error":"#DIV/0!"}},{"$f":"Tool!K22*Tool!F22/Tool!$K$27","v":{"$error":"#DIV/0!"}},{"$f":"IF(H10<>0,Tool!D22,\"\")","v":{"$error":"#DIV/0!"}},{"$f":"Tool!L22*Tool!F22/Tool!$L$27","v":{"$error":"#DIV/0!"}}]
[{"$f":"IF(B11<>0,Tool!D23,\"\")","v":{"$error":"#DIV/0!"}},{"$f":"Tool!G23*Tool!F23/Tool!$G$27","v":{"$error":"#DIV/0!"}},{"$f":"IF(D11<>0,Tool!D23,\"\")","v":{"$error":"#DIV/0!"}},{"$f":"Tool!H23*Tool!F23/Tool!$H$27","v":{"$error":"#DIV/0!"}},{"$f":"IF(F11<>0,Tool!D23,\"\")","v":{"$error":"#DIV/0!"}},{"$f":"Tool!K23*Tool!F23/Tool!$K$27","v":{"$error":"#DIV/0!"}},{"$f":"IF(H11<>0,Tool!D23,\"\")","v":{"$error":"#DIV/0!"}},{"$f":"Tool!L23*Tool!F23/Tool!$L$27","v":{"$error":"#DIV/0!"}}]
[{"$f":"IF(B12<>0,Tool!D24,\"\")","v":{"$error":"#DIV/0!"}},{"$f":"Tool!G24*Tool!F24/Tool!$G$27","v":{"$error":"#DIV/0!"}},{"$f":"IF(D12<>0,Tool!D24,\"\")","v":{"$error":"#DIV/0!"}},{"$f":"Tool!H24*Tool!F24/Tool!$H$27","v":{"$error":"#DIV/0!"}},{"$f":"IF(F12<>0,Tool!D24,\"\")","v":{"$error":"#DIV/0!"}},{"$f":"Tool!K24*Tool!F24/Tool!$K$27","v":{"$error":"#DIV/0!"}},{"$f":"IF(H12<>0,Tool!D24,\"\")","v":{"$error":"#DIV/0!"}},{"$f":"Tool!L24*Tool!F24/Tool!$L$27","v":{"$error":"#DIV/0!"}}]
[{"$f":"IF(B13<>0,Tool!D25,\"\")","v":{"$error":"#DIV/0!"}},{"$f":"Tool!G25*Tool!F25/Tool!$G$27","v":{"$error":"#DIV/0!"}},{"$f":"IF(D13<>0,Tool!D25,\"\")","v":{"$error":"#DIV/0!"}},{"$f":"Tool!H25*Tool!F25/Tool!$H$27","v":{"$error":"#DIV/0!"}},{"$f":"IF(F13<>0,Tool!D25,\"\")","v":{"$error":"#DIV/0!"}},{"$f":"Tool!K25*Tool!F25/Tool!$K$27","v":{"$error":"#DIV/0!"}},{"$f":"IF(H13<>0,Tool!D25,\"\")","v":{"$error":"#DIV/0!"}},{"$f":"Tool!L25*Tool!F25/Tool!$L$27","v":{"$error":"#DIV/0!"}}]
["Total ",{"$f":"SUM(B2:B13)","v":{"$error":"#DIV/0!"}},null,{"$f":"SUM(D2:D13)","v":{"$error":"#DIV/0!"}},null,{"$f":"SUM(F2:F13)","v":{"$error":"#DIV/0!"}},null,{"$f":"SUM(H2:H13)","v":{"$error":"#DIV/0!"}}]

{"sheet":"List_sheet","index":7,"n_rows":100,"n_cols":12,"rows_kept":100,"hidden":true}
["Value scenarios","Ligne","Ligne filtrée","Ligne triee","Liste unique scenarios","Valeur formula","Ligne","Ligne filtrée","Ligne triee","Liste unique Formula"]
[{"$f":"IFERROR(Requirment[[#This Row],[Scenarios_reference]],\"\")","v":"Broiler_2.4 Kg alive 63 days_3"},{"$f":"ROW()-1","v":1},{"$f":"IF(COUNTIF($A$2:A2,A2)=1,ROW()-1,\"\")","v":1},{"$f":"IFERROR(SMALL(C:C,B2),\"\")","v":1},{"$f":"IFERROR(INDEX($A$2:$A$99,D2),\"\")","v":"Broiler_2.4 Kg alive 63 days_3"},{"$f":"IFERROR(Requirment[[#This Row],[Formula_Name]],\"\")","v":"Finishing"},{"$f":"ROW()-1","v":1},{"$f":"IF(COUNTIF($F$2:F2,F2)=1,ROW()-1,\"\")","v":1},{"$f":"IFERROR(SMALL(H:H,G2),\"\")","v":1},{"$f":"IFERROR(INDEX($F$2:$F$99,I2),\"\")","v":"Finishing"}]
[{"$f":"IFERROR(Requirment[[#This Row],[Scenarios_reference]],\"\")","v":"Broiler_2.4 Kg alive 63 days_3"},{"$f":"ROW()-1","v":2},{"$f":"IF(COUNTIF($A$2:A3,A3)=1,ROW()-1,\"\")","v":""},{"$f":"IFERROR(SMALL(C:C,B3),\"\")","v":4},{"$f":"IFERROR(INDEX($A$2:$A$99,D3),\"\")","v":"Broiler_2.6 kg alive at 112 days_2 feeds_3"},{"$f":"IFERROR(Requirment[[#This Row],[Formula_Name]],\"\")","v":"Growing"},{"$f":"ROW()-1","v":2},{"$f":"IF(COUNTIF($F$2:F3,F3)=1,ROW()-1,\"\")","v":2},{"$f":"IFERROR(SMALL(H:H,G3),\"\")","v":2},{"$f":"IFERROR(INDEX($F$2:$F$99,I3),\"\")","v":"Growing"}]
[{"$f":"IFERROR(Requirment[[#This Row],[Scenarios_reference]],\"\")","v":"Broiler_2.4 Kg alive 63 days_3"},3,{"$f":"IF(COUNTIF($A$2:A4,A4)=1,ROW()-1,\"\")","v":""},7,"Broiler_2.6 kg alive at 126 days_3 feeds_3",{"$f":"IFERROR(Requirment[[#This Row],[Formula_Name]],\"\")","v":"Starter"},3,{"$f":"IF(COUNTIF($F$2:F4,F4)=1,ROW()-1,\"\")","v":3},3,"Starter",null,"Protection feuille:"]
[{"$f":"IFERROR(Requirment[[#This Row],[Scenarios_reference]],\"\")","v":"Broiler_2.6 kg alive at 112 days_2 feeds_3"},4,{"$f":"IF(COUNTIF($A$2:A5,A5)=1,ROW()-1,\"\")","v":4},10,"Broiler_2.6 kg alive at 126 days_4 feeds_4",{"$f":"IFERROR(Requirment[[#This Row],[Formula_Name]],\"\")","v":"Finishing"},4,{"$f":"IF(COUNTIF($F$2:F5,F5)=1,ROW()-1,\"\")","v":""},10,"Finishing 1",null,"ITAB"]
[{"$f":"IFERROR(Requirment[[#This Row],[Scenarios_reference]],\"\")","v":"Broiler_2.6 kg alive at 112 days_2 feeds_3"},5,{"$f":"IF(COUNTIF($A$2:A6,A6)=1,ROW()-1,\"\")","v":""},14,"Broiler_2.6 kg alive at 98 days_2 feeds_2",{"$f":"IFERROR(Requirment[[#This Row],[Formula_Name]],\"\")","v":"Growing"},5,{"$f":"IF(COUNTIF($F$2:F6,F6)=1,ROW()-1,\"\")","v":""},11,"Finishing 2"]
[{"$f":"IFERROR(Requirment[[#This Row],[Scenarios_reference]],\"\")","v":"Broiler_2.6 kg alive at 112 days_2 feeds_3"},6,{"$f":"IF(COUNTIF($A$2:A7,A7)=1,ROW()-1,\"\")","v":""},16,"Broiler_2.6 kg alive at 98 days_3 feeds_3",{"$f":"IFERROR(Requirment[[#This Row],[Formula_Name]],\"\")","v":"Starter"},6,{"$f":"IF(COUNTIF($F$2:F7,F7)=1,ROW()-1,\"\")","v":""},14,"Single feed"]
[{"$f":"IFERROR(Requirment[[#This Row],[Scenarios_reference]],\"\")","v":"Broiler_2.6 kg alive at 126 days_3 feeds_3"},7,{"$f":"IF(COUNTIF($A$2:A8,A8)=1,ROW()-1,\"\")","v":7},19,"Broiler_2.4 kg alive 84 days_2",{"$f":"IFERROR(Requirment[[#This Row],[Formula_Name]],\"\")","v":"Finishing"},7,{"$f":"IF(COUNTIF($F$2:F8,F8)=1,ROW()-1,\"\")","v":""},23,"Laying"]
[{"$f":"IFERROR(Requirment[[#This Row],[Scenarios_reference]],\"\")","v":"Broiler_2.6 kg alive at 126 days_3 feeds_3"},8,{"$f":"IF(COUNTIF($A$2:A9,A9)=1,ROW()-1,\"\")","v":""},21,"Pullets_Growers_2",{"$f":"IFERROR(Requirment[[#This Row],[Formula_Name]],\"\")","v":"Growing"},8,{"$f":"IF(COUNTIF($F$2:F9,F9)=1,ROW()-1,\"\")","v":""},24,"Starter laying"]
[{"$f":"IFERROR(Requirment[[#This Row],[Scenarios_reference]],\"\")","v":"Broiler_2.6 kg alive at 126 days_3 feeds_3"},9,{"$f":"IF(COUNTIF($A$2:A10,A10)=1,ROW()-1,\"\")","v":""},23,"Laying Hen_High level 250 to 300 eggs per year_ 2 Feeds_2",{"$f":"IFERROR(Requirment[[#This Row],[Formula_Name]],\"\")","v":"Starter"},9,{"$f":"IF(COUNTIF($F$2:F10,F10)=1,ROW()-1,\"\")","v":""},32,0]
[{"$f":"IFERROR(Requirment[[#This Row],[Scenarios_reference]],\"\")","v":"Broiler_2.6 kg alive at 126 days_4 feeds_4"},10,{"$f":"IF(COUNTIF($A$2:A11,A11)=1,ROW()-1,\"\")","v":10},25,"Laying Hen_High level 250 to 300 eggs per year_ 3 Feeds_2",{"$f":"IFERROR(Requirment[[#This Row],[Formula_Name]],\"\")","v":"Finishing 1"},10,{"$f":"IF(COUNTIF($F$2:F11,F11)=1,ROW()-1,\"\")","v":10},"",""]
[{"$f":"IFERROR(Requirment[[#This Row],[Scenarios_reference]],\"\")","v":"Broiler_2.6 kg alive at 126 days_4 feeds_4"},11,{"$f":"IF(COUNTIF($A$2:A12,A12)=1,ROW()-1,\"\")","v":""},28,"Laying Hen_Low level 170 eggs per year_ 2 Feeds_2",{"$f":"IFERROR(Requirment[[#This Row],[Formula_Name]],\"\")","v":"Finishing 2"},11,{"$f":"IF(COUNTIF($F$2:F12,F12)=1,ROW()-1,\"\")","v":11},"",""]
[{"$f":"IFERROR(Requirment[[#This Row],[Scenarios_reference]],\"\")","v":"Broiler_2.6 kg alive at 126 days_4 feeds_4"},12,{"$f":"IF(COUNTIF($A$2:A13,A13)=1,ROW()-1,\"\")","v":""},30,"Laying hens_One feed ans grains  no Min Max_1",{"$f":"IFERROR(Requirment[[#This Row],[Formula_Name]],\"\")","v":"Growing"},12,{"$f":"IF(COUNTIF($F$2:F13,F13)=1,ROW()-1,\"\")","v":""},"",""]
[{"$f":"IFERROR(Requirment[[#This Row],[Scenarios_reference]],\"\")","v":"Broiler_2.6 kg alive at 126 days_4 feeds_4"},13,{"$f":"IF(COUNTIF($A$2:A14,A14)=1,ROW()-1,\"\")","v":""},31,"Broiler_Broiler_2.6 kg alive at 98 days_3 feeds_3_Finishing_Red clover silage_3",{"$f":"IFERROR(Requirment[[#This Row],[Formula_Name]],\"\")","v":"Starter"},13,{"$f":"IF(COUNTIF($F$2:F14,F14)=1,ROW()-1,\"\")","v":""},"",""]
[{"$f":"IFERROR(Requirment[[#This Row],[Scenarios_reference]],\"\")","v":"Broiler_2.6 kg alive at 98 days_2 feeds_2"},14,{"$f":"IF(COUNTIF($A$2:A15,A15)=1,ROW()-1,\"\")","v":14},32,"__",{"$f":"IFERROR(Requirment[[#This Row],[Formula_Name]],\"\")","v":"Single feed"},14,{"$f":"IF(COUNTIF($F$2:F15,F15)=1,ROW()-1,\"\")","v":14},"",""]
[{"$f":"IFERROR(Requirment[[#This Row],[Scenarios_reference]],\"\")","v":"Broiler_2.6 kg alive at 98 days_2 feeds_2"},15,{"$f":"IF(COUNTIF($A$2:A16,A16)=1,ROW()-1,\"\")","v":""},"","",{"$f":"IFERROR(Requirment[[#This Row],[Formula_Name]],\"\")","v":"Starter"},15,{"$f":"IF(COUNTIF($F$2:F16,F16)=1,ROW()-1,\"\")","v":""},"",""]
[{"$f":"IFERROR(Requirment[[#This Row],[Scenarios_reference]],\"\")","v":"Broiler_2.6 kg alive at 98 days_3 feeds_3"},16,{"$f":"IF(COUNTIF($A$2:A17,A17)=1,ROW()-1,\"\")","v":16},"","",{"$f":"IFERROR(Requirment[[#This Row],[Formula_Name]],\"\")","v":"Finishing"},16,{"$f":"IF(COUNTIF($F$2:F17,F17)=1,ROW()-1,\"\")","v":""},"",""]
[{"$f":"IFERROR(Requirment[[#This Row],[Scenarios_reference]],\"\")","v":"Broiler_2.6 kg alive at 98 days_3 feeds_3"},17,{"$f":"IF(COUNTIF($A$2:A18,A18)=1,ROW()-1,\"\")","v":""},"","",{"$f":"IFERROR(Requirment[[#This Row],[Formula_Name]],\"\")","v":"Growing"},17,{"$f":"IF(COUNTIF($F$2:F18,F18)=1,ROW()-1,\"\")","v":""},"",""]
[{"$f":"IFERROR(Requirment[[#This Row],[Scenarios_reference]],\"\")","v":"Broiler_2.6 kg alive at 98 days_3 feeds_3"},18,{"$f":"IF(COUNTIF($A$2:A19,A19)=1,ROW()-1,\"\")","v":""},"","",{"$f":"IFERROR(Requirment[[#This Row],[Formula_Name]],\"\")","v":"Starter"},18,{"$f":"IF(COUNTIF($F$2:F19,F19)=1,ROW()-1,\"\")","v":""},"",""]
[{"$f":"IFERROR(Requirment[[#This Row],[Scenarios_reference]],\"\")","v":"Broiler_2.4 kg alive 84 days_2"},19,{"$f":"IF(COUNTIF($A$2:A20,A20)=1,ROW()-1,\"\")","v":19},"","",{"$f":"IFERROR(Requirment[[#This Row],[Formula_Name]],\"\")","v":"Finishing"},19,{"$f":"IF(COUNTIF($F$2:F20,F20)=1,ROW()-1,\"\")","v":""},"",""]
[{"$f":"IFERROR(Requirment[[#This Row],[Scenarios_reference]],\"\")","v":"Broiler_2.4 kg alive 84 days_2"},20,{"$f":"IF(COUNTIF($A$2:A21,A21)=1,ROW()-1,\"\")","v":""},"","",{"$f":"IFERROR(Requirment[[#This Row],[Formula_Name]],\"\")","v":"Starter"},20,{"$f":"IF(COUNTIF($F$2:F21,F21)=1,ROW()-1,\"\")","v":""},"",""]
[{"$f":"IFERROR(Requirment[[#This Row],[Scenarios_reference]],\"\")","v":"Pullets_Growers_2"},21,{"$f":"IF(COUNTIF($A$2:A22,A22)=1,ROW()-1,\"\")","v":21},"","",{"$f":"IFERROR(Requirment[[#This Row],[Formula_Name]],\"\")","v":"Growing"},21,{"$f":"IF(COUNTIF($F$2:F22,F22)=1,ROW()-1,\"\")","v":""},"",""]
[{"$f":"IFERROR(Requirment[[#This Row],[Scenarios_reference]],\"\")","v":"Pullets_Growers_2"},22,{"$f":"IF(COUNTIF($A$2:A23,A23)=1,ROW()-1,\"\")","v":""},"","",{"$f":"IFERROR(Requirment[[#This Row],[Formula_Name]],\"\")","v":"Starter"},22,{"$f":"IF(COUNTIF($F$2:F23,F23)=1,ROW()-1,\"\")","v":""},"",""]
[{"$f":"IFERROR(Requirment[[#This Row],[Scenarios_reference]],\"\")","v":"Laying Hen_High level 250 to 300 eggs per year_ 2 Feeds_2"},23,{"$f":"IF(COUNTIF($A$2:A24,A24)=1,ROW()-1,\"\")","v":23},"","",{"$f":"IFERROR(Requirment[[#This Row],[Formula_Name]],\"\")","v":"Laying"},23,{"$f":"IF(COUNTIF($F$2:F24,F24)=1,ROW()-1,\"\")","v":23},"",""]
[{"$f":"IFERROR(Requirment[[#This Row],[Scenarios_reference]],\"\")","v":"Laying Hen_High level 250 to 300 eggs per year_ 2 Feeds_2"},24,{"$f":"IF(COUNTIF($A$2:A25,A25)=1,ROW()-1,\"\")","v":""},"","",{"$f":"IFERROR(Requirment[[#This Row],[Formula_Name]],\"\")","v":"Starter laying"},24,{"$f":"IF(COUNTIF($F$2:F25,F25)=1,ROW()-1,\"\")","v":24},"",""]
[{"$f":"IFERROR(Requirment[[#This Row],[Scenarios_reference]],\"\")","v":"Laying Hen_High level 250 to 300 eggs per year_ 3 Feeds_2"},25,{"$f":"IF(COUNTIF($A$2:A26,A26)=1,ROW()-1,\"\")","v":25},"","",{"$f":"IFERROR(Requirment[[#This Row],[Formula_Name]],\"\")","v":"Laying"},25,{"$f":"IF(COUNTIF($F$2:F26,F26)=1,ROW()-1,\"\")","v":""},"",""]
[{"$f":"IFERROR(Requirment[[#This Row],[Scenarios_reference]],\"\")","v":"Laying Hen_High level 250 to 300 eggs per year_ 3 Feeds_2"},26,{"$f":"IF(COUNTIF($A$2:A27,A27)=1,ROW()-1,\"\")","v":""},"","",{"$f":"IFERROR(Requirment[[#This Row],[Formula_Name]],\"\")","v":"Laying"},26,{"$f":"IF(COUNTIF($F$2:F27,F27)=1,ROW()-1,\"\")","v":""},"",""]
[{"$f":"IFERROR(Requirment[[#This Row],[Scenarios_reference]],\"\")","v":"Laying Hen_High level 250 to 300 eggs per year_ 3 Feeds_2"},27,{"$f":"IF(COUNTIF($A$2:A28,A28)=1,ROW()-1,\"\")","v":""},"","",{"$f":"IFERROR(Requirment[[#This Row],[Formula_Name]],\"\")","v":"Starter laying"},27,{"$f":"IF(COUNTIF($F$2:F28,F28)=1,ROW()-1,\"\")","v":""},"",""]
[{"$f":"IFERROR(Requirment[[#This Row],[Scenarios_reference]],\"\")","v":"Laying Hen_Low level 170 eggs per year_ 2 Feeds_2"},28,{"$f":"IF(COUNTIF($A$2:A29,A29)=1,ROW()-1,\"\")","v":28},"","",{"$f":"IFERROR(Requirment[[#This Row],[Formula_Name]],\"\")","v":"Laying"},28,{"$f":"IF(COUNTIF($F$2:F29,F29)=1,ROW()-1,\"\")","v":""},"",""]
[{"$f":"IFERROR(Requirment[[#This Row],[Scenarios_reference]],\"\")","v":"Laying Hen_Low level 170 eggs per year_ 2 Feeds_2"},29,{"$f":"IF(COUNTIF($A$2:A30,A30)=1,ROW()-1,\"\")","v":""},"","",{"$f":"IFERROR(Requirment[[#This Row],[Formula_Name]],\"\")","v":"Starter laying"},29,{"$f":"IF(COUNTIF($F$2:F30,F30)=1,ROW()-1,\"\")","v":""},"",""]
[{"$f":"IFERROR(Requirment[[#This Row],[Scenarios_reference]],\"\")","v":"Laying hens_One feed ans grains  no Min Max_1"},30,{"$f":"IF(COUNTIF($A$2:A31,A31)=1,ROW()-1,\"\")","v":30},"","",{"$f":"IFERROR(Requirment[[#This Row],[Formula_Name]],\"\")","v":"Single feed"},30,{"$f":"IF(COUNTIF($F$2:F31,F31)=1,ROW()-1,\"\")","v":""},"",""]
[{"$f":"IFERROR(Requirment[[#This Row],[Scenarios_reference]],\"\")","v":"Broiler_Broiler_2.6 kg alive at 98 days_3 feeds_3_Finishing_Red clover silage_3"},31,{"$f":"IF(COUNTIF($A$2:A32,A32)=1,ROW()-1,\"\")","v":31},"","",{"$f":"IFERROR(Requirment[[#This Row],[Formula_Name]],\"\")","v":"Finishing"},31,{"$f":"IF(COUNTIF($F$2:F32,F32)=1,ROW()-1,\"\")","v":""},"",""]
[{"$f":"IFERROR(Requirment[[#This Row],[Scenarios_reference]],\"\")","v":"__"},32,{"$f":"IF(COUNTIF($A$2:A33,A33)=1,ROW()-1,\"\")","v":32},"","",{"$f":"IFERROR(Requirment[[#This Row],[Formula_Name]],\"\")","v":0},32,{"$f":"IF(COUNTIF($F$2:F33,F33)=1,ROW()-1,\"\")","v":32},"",""]
[{"$f":"IFERROR(Requirment[[#This Row],[Scenarios_reference]],\"\")","v":"__"},33,{"$f":"IF(COUNTIF($A$2:A34,A34)=1,ROW()-1,\"\")","v":""},"","",{"$f":"IFERROR(Requirment[[#This Row],[Formula_Name]],\"\")","v":0},33,{"$f":"IF(COUNTIF($F$2:F34,F34)=1,ROW()-1,\"\")","v":""},"",""]
[{"$f":"IFERROR(Requirment[[#This Row],[Scenarios_reference]],\"\")","v":"__"},34,{"$f":"IF(COUNTIF($A$2:A35,A35)=1,ROW()-1,\"\")","v":""},"","",{"$f":"IFERROR(Requirment[[#This Row],[Formula_Name]],\"\")","v":0},34,{"$f":"IF(COUNTIF($F$2:F35,F35)=1,ROW()-1,\"\")","v":""},"",""]
[{"$f":"IFERROR(Requirment[[#This Row],[Scenarios_reference]],\"\")","v":"__"},35,{"$f":"IF(COUNTIF($A$2:A36,A36)=1,ROW()-1,\"\")","v":""},"","",{"$f":"IFERROR(Requirment[[#This Row],[Formula_Name]],\"\")","v":0},35,{"$f":"IF(COUNTIF($F$2:F36,F36)=1,ROW()-1,\"\")","v":""},"",""]
[{"$f":"IFERROR(Requirment[[#This Row],[Scenarios_reference]],\"\")","v":"__"},36,{"$f":"IF(COUNTIF($A$2:A37,A37)=1,ROW()-1,\"\")","v":""},"","",{"$f":"IFERROR(Requirment[[#This Row],[Formula_Name]],\"\")","v":0},36,{"$f":"IF(COUNTIF($F$2:F37,F37)=1,ROW()-1,\"\")","v":""},"",""]
[{"$f":"IFERROR(Requirment[[#This Row],[Scenarios_reference]],\"\")","v":"__"},37,{"$f":"IF(COUNTIF($A$2:A38,A38)=1,ROW()-1,\"\")","v":""},"","",{"$f":"IFERROR(Requirment[[#This Row],[Formula_Name]],\"\")","v":0},37,{"$f":"IF(COUNTIF($F$2:F38,F38)=1,ROW()-1,\"\")","v":""},"",""]
[{"$f":"IFERROR(Requirment[[#This Row],[Scenarios_reference]],\"\")","v":"__"},38,{"$f":"IF(COUNTIF($A$2:A39,A39)=1,ROW()-1,\"\")","v":""},"","",{"$f":"IFERROR(Requirment[[#This Row],[Formula_Name]],\"\")","v":0},38,{"$f":"IF(COUNTIF($F$2:F39,F39)=1,ROW()-1,\"\")","v":""},"",""]
[{"$f":"IFERROR(Requirment[[#This Row],[Scenarios_reference]],\"\")","v":"__"},39,{"$f":"IF(COUNTIF($A$2:A40,A40)=1,ROW()-1,\"\")","v":""},"","",{"$f":"IFERROR(Requirment[[#This Row],[Formula_Name]],\"\")","v":0},39,{"$f":"IF(COUNTIF($F$2:F40,F40)=1,ROW()-1,\"\")","v":""},"",""]
[{"$f":"IFERROR(Requirment[[#This Row],[Scenarios_reference]],\"\")","v":"__"},40,{"$f":"IF(COUNTIF($A$2:A41,A41)=1,ROW()-1,\"\")","v":""},"","",{"$f":"IFERROR(Requirment[[#This Row],[Formula_Name]],\"\")","v":0},40,{"$f":"IF(COUNTIF($F$2:F41,F41)=1,ROW()-1,\"\")","v":""},"",""]
[{"$f":"IFERROR(Requirment[[#This Row],[Scenarios_reference]],\"\")","v":"__"},41,{"$f":"IF(COUNTIF($A$2:A42,A42)=1,ROW()-1,\"\")","v":""},"","",{"$f":"IFERROR(Requirment[[#This Row],[Formula_Name]],\"\")","v":0},41,{"$f":"IF(COUNTIF($F$2:F42,F42)=1,ROW()-1,\"\")","v":""},"",""]
[{"$f":"IFERROR(Requirment[[#This Row],[Scenarios_reference]],\"\")","v":"__"},42,{"$f":"IF(COUNTIF($A$2:A43,A43)=1,ROW()-1,\"\")","v":""},"","",{"$f":"IFERROR(Requirment[[#This Row],[Formula_Name]],\"\")","v":0},42,{"$f":"IF(COUNTIF($F$2:F43,F43)=1,ROW()-1,\"\")","v":""},"",""]
[{"$f":"IFERROR(Requirment[[#This Row],[Scenarios_reference]],\"\")","v":"__"},43,{"$f":"IF(COUNTIF($A$2:A44,A44)=1,ROW()-1,\"\")","v":""},"","",{"$f":"IFERROR(Requirment[[#This Row],[Formula_Name]],\"\")","v":0},43,{"$f":"IF(COUNTIF($F$2:F44,F44)=1,ROW()-1,\"\")","v":""},"",""]
[{"$f":"IFERROR(Requirment[[#This Row],[Scenarios_reference]],\"\")","v":"__"},44,{"$f":"IF(COUNTIF($A$2:A45,A45)=1,ROW()-1,\"\")","v":""},"","",{"$f":"IFERROR(Requirment[[#This Row],[Formula_Name]],\"\")","v":0},44,{"$f":"IF(COUNTIF($F$2:F45,F45)=1,ROW()-1,\"\")","v":""},"",""]
[{"$f":"IFERROR(Requirment[[#This Row],[Scenarios_reference]],\"\")","v":"__"},45,{"$f":"IF(COUNTIF($A$2:A46,A46)=1,ROW()-1,\"\")","v":""},"","",{"$f":"IFERROR(Requirment[[#This Row],[Formula_Name]],\"\")","v":0},45,{"$f":"IF(COUNTIF($F$2:F46,F46)=1,ROW()-1,\"\")","v":""},"",""]
[{"$f":"IFERROR(Requirment[[#This Row],[Scenarios_reference]],\"\")","v":"__"},46,{"$f":"IF(COUNTIF($A$2:A47,A47)=1,ROW()-1,\"\")","v":""},"","",{"$f":"IFERROR(Requirment[[#This Row],[Formula_Name]],\"\")","v":0},46,{"$f":"IF(COUNTIF($F$2:F47,F47)=1,ROW()-1,\"\")","v":""},"",""]
[{"$f":"IFERROR(Requirment[[#This Row],[Scenarios_reference]],\"\")","v":"__"},47,{"$f":"IF(COUNTIF($A$2:A48,A48)=1,ROW()-1,\"\")","v":""},"","",{"$f":"IFERROR(Requirment[[#This Row],[Formula_Name]],\"\")","v":0},47,{"$f":"IF(COUNTIF($F$2:F48,F48)=1,ROW()-1,\"\")","v":""},"",""]
[{"$f":"IFERROR(Requirment[[#This Row],[Scenarios_reference]],\"\")","v":"__"},48,{"$f":"IF(COUNTIF($A$2:A49,A49)=1,ROW()-1,\"\")","v":""},"","",{"$f":"IFERROR(Requirment[[#This Row],[Formula_Name]],\"\")","v":0},48,{"$f":"IF(COUNTIF($F$2:F49,F49)=1,ROW()-1,\"\")","v":""},"",""]
[{"$f":"IFERROR(Requirment[[#This Row],[Scenarios_reference]],\"\")","v":"__"},49,{"$f":"IF(COUNTIF($A$2:A50,A50)=1,ROW()-1,\"\")","v":""},"","",{"$f":"IFERROR(Requirment[[#This Row],[Formula_Name]],\"\")","v":0},49,{"$f":"IF(COUNTIF($F$2:F50,F50)=1,ROW()-1,\"\")","v":""},"",""]
[{"$f":"IFERROR(Requirment[[#This Row],[Scenarios_reference]],\"\")","v":"__"},50,{"$f":"IF(COUNTIF($A$2:A51,A51)=1,ROW()-1,\"\")","v":""},"","",{"$f":"IFERROR(Requirment[[#This Row],[Formula_Name]],\"\")","v":0},50,{"$f":"IF(COUNTIF($F$2:F51,F51)=1,ROW()-1,\"\")","v":""},"",""]
[{"$f":"IFERROR(Requirment[[#This Row],[Scenarios_reference]],\"\")","v":"__"},51,{"$f":"IF(COUNTIF($A$2:A52,A52)=1,ROW()-1,\"\")","v":""},"","",{"$f":"IFERROR(Requirment[[#This Row],[Formula_Name]],\"\")","v":0},51,{"$f":"IF(COUNTIF($F$2:F52,F52)=1,ROW()-1,\"\")","v":""},"",""]
[{"$f":"IFERROR(Requirment[[#This Row],[Scenarios_reference]],\"\")","v":"__"},52,{"$f":"IF(COUNTIF($A$2:A53,A53)=1,ROW()-1,\"\")","v":""},"","",{"$f":"IFERROR(Requirment[[#This Row],[Formula_Name]],\"\")","v":0},52,{"$f":"IF(COUNTIF($F$2:F53,F53)=1,ROW()-1,\"\")","v":""},"",""]
[{"$f":"IFERROR(Requirment[[#This Row],[Scenarios_reference]],\"\")","v":"__"},53,{"$f":"IF(COUNTIF($A$2:A54,A54)=1,ROW()-1,\"\")","v":""},"","",{"$f":"IFERROR(Requirment[[#This Row],[Formula_Name]],\"\")","v":0},53,{"$f":"IF(COUNTIF($F$2:F54,F54)=1,ROW()-1,\"\")","v":""},"",""]
[{"$f":"IFERROR(Requirment[[#This Row],[Scenarios_reference]],\"\")","v":"__"},54,{"$f":"IF(COUNTIF($A$2:A55,A55)=1,ROW()-1,\"\")","v":""},"","",{"$f":"IFERROR(Requirment[[#This Row],[Formula_Name]],\"\")","v":0},54,{"$f":"IF(COUNTIF($F$2:F55,F55)=1,ROW()-1,\"\")","v":""},"",""]
[{"$f":"IFERROR(Requirment[[#This Row],[Scenarios_reference]],\"\")","v":"__"},55,{"$f":"IF(COUNTIF($A$2:A56,A56)=1,ROW()-1,\"\")","v":""},"","",{"$f":"IFERROR(Requirment[[#This Row],[Formula_Name]],\"\")","v":0},55,{"$f":"IF(COUNTIF($F$2:F56,F56)=1,ROW()-1,\"\")","v":""},"",""]
[{"$f":"IFERROR(Requirment[[#This Row],[Scenarios_reference]],\"\")","v":"__"},56,{"$f":"IF(COUNTIF($A$2:A57,A57)=1,ROW()-1,\"\")","v":""},"","",{"$f":"IFERROR(Requirment[[#This Row],[Formula_Name]],\"\")","v":0},56,{"$f":"IF(COUNTIF($F$2:F57,F57)=1,ROW()-1,\"\")","v":""},"",""]
[{"$f":"IFERROR(Requirment[[#This Row],[Scenarios_reference]],\"\")","v":"__"},57,{"$f":"IF(COUNTIF($A$2:A58,A58)=1,ROW()-1,\"\")","v":""},"","",{"$f":"IFERROR(Requirment[[#This Row],[Formula_Name]],\"\")","v":0},57,{"$f":"IF(COUNTIF($F$2:F58,F58)=1,ROW()-1,\"\")","v":""},"",""]
[{"$f":"IFERROR(Requirment[[#This Row],[Scenarios_reference]],\"\")","v":"__"},58,{"$f":"IF(COUNTIF($A$2:A59,A59)=1,ROW()-1,\"\")","v":""},"","",{"$f":"IFERROR(Requirment[[#This Row],[Formula_Name]],\"\")","v":0},58,{"$f":"IF(COUNTIF($F$2:F59,F59)=1,ROW()-1,\"\")","v":""},"",""]
[{"$f":"IFERROR(Requirment[[#This Row],[Scenarios_reference]],\"\")","v":"__"},59,{"$f":"IF(COUNTIF($A$2:A60,A60)=1,ROW()-1,\"\")","v":""},"","",{"$f":"IFERROR(Requirment[[#This Row],[Formula_Name]],\"\")","v":0},59,{"$f":"IF(COUNTIF($F$2:F60,F60)=1,ROW()-1,\"\")","v":""},"",""]
[{"$f":"IFERROR(Requirment[[#This Row],[Scenarios_reference]],\"\")","v":"__"},60,{"$f":"IF(COUNTIF($A$2:A61,A61)=1,ROW()-1,\"\")","v":""},"","",{"$f":"IFERROR(Requirment[[#This Row],[Formula_Name]],\"\")","v":0},60,{"$f":"IF(COUNTIF($F$2:F61,F61)=1,ROW()-1,\"\")","v":""},"",""]
[{"$f":"IFERROR(Requirment[[#This Row],[Scenarios_reference]],\"\")","v":"__"},61,{"$f":"IF(COUNTIF($A$2:A62,A62)=1,ROW()-1,\"\")","v":""},"","",{"$f":"IFERROR(Requirment[[#This Row],[Formula_Name]],\"\")","v":0},61,{"$f":"IF(COUNTIF($F$2:F62,F62)=1,ROW()-1,\"\")","v":""},"",""]
[{"$f":"IFERROR(Requirment[[#This Row],[Scenarios_reference]],\"\")","v":"__"},62,{"$f":"IF(COUNTIF($A$2:A63,A63)=1,ROW()-1,\"\")","v":""},"","",{"$f":"IFERROR(Requirment[[#This Row],[Formula_Name]],\"\")","v":0},62,{"$f":"IF(COUNTIF($F$2:F63,F63)=1,ROW()-1,\"\")","v":""},"",""]
[{"$f":"IFERROR(Requirment[[#This Row],[Scenarios_reference]],\"\")","v":"__"},63,{"$f":"IF(COUNTIF($A$2:A64,A64)=1,ROW()-1,\"\")","v":""},"","",{"$f":"IFERROR(Requirment[[#This Row],[Formula_Name]],\"\")","v":0},63,{"$f":"IF(COUNTIF($F$2:F64,F64)=1,ROW()-1,\"\")","v":""},"",""]
[{"$f":"IFERROR(Requirment[[#This Row],[Scenarios_reference]],\"\")","v":"__"},64,{"$f":"IF(COUNTIF($A$2:A65,A65)=1,ROW()-1,\"\")","v":""},"","",{"$f":"IFERROR(Requirment[[#This Row],[Formula_Name]],\"\")","v":0},64,{"$f":"IF(COUNTIF($F$2:F65,F65)=1,ROW()-1,\"\")","v":""},"",""]
[{"$f":"IFERROR(Requirment[[#This Row],[Scenarios_reference]],\"\")","v":"__"},65,{"$f":"IF(COUNTIF($A$2:A66,A66)=1,ROW()-1,\"\")","v":""},"","",{"$f":"IFERROR(Requirment[[#This Row],[Formula_Name]],\"\")","v":0},65,{"$f":"IF(COUNTIF($F$2:F66,F66)=1,ROW()-1,\"\")","v":""},"",""]
[{"$f":"IFERROR(Requirment[[#This Row],[Scenarios_reference]],\"\")","v":"__"},{"$f":"ROW()-1","v":66},{"$f":"IF(COUNTIF($A$2:A67,A67)=1,ROW()-1,\"\")","v":""},{"$f":"IFERROR(SMALL(C:C,B67),\"\")","v":""},{"$f":"IFERROR(INDEX($A$2:$A$99,D67),\"\")","v":""},{"$f":"IFERROR(Requirment[[#This Row],[Formula_Name]],\"\")","v":0},{"$f":"ROW()-1","v":66},{"$f":"IF(COUNTIF($F$2:F67,F67)=1,ROW()-1,\"\")","v":""},{"$f":"IFERROR(SMALL(H:H,G67),\"\")","v":""},{"$f":"IFERROR(INDEX($F$2:$F$99,I67),\"\")","v":""}]
[{"$f":"IFERROR(Requirment[[#This Row],[Scenarios_reference]],\"\")","v":"__"},67,{"$f":"IF(COUNTIF($A$2:A68,A68)=1,ROW()-1,\"\")","v":""},"","",{"$f":"IFERROR(Requirment[[#This Row],[Formula_Name]],\"\")","v":0},67,{"$f":"IF(COUNTIF($F$2:F68,F68)=1,ROW()-1,\"\")","v":""},"",""]
[{"$f":"IFERROR(Requirment[[#This Row],[Scenarios_reference]],\"\")","v":"__"},68,{"$f":"IF(COUNTIF($A$2:A69,A69)=1,ROW()-1,\"\")","v":""},"","",{"$f":"IFERROR(Requirment[[#This Row],[Formula_Name]],\"\")","v":0},68,{"$f":"IF(COUNTIF($F$2:F69,F69)=1,ROW()-1,\"\")","v":""},"",""]
[{"$f":"IFERROR(Requirment[[#This Row],[Scenarios_reference]],\"\")","v":"__"},69,{"$f":"IF(COUNTIF($A$2:A70,A70)=1,ROW()-1,\"\")","v":""},"","",{"$f":"IFERROR(Requirment[[#This Row],[Formula_Name]],\"\")","v":0},69,{"$f":"IF(COUNTIF($F$2:F70,F70)=1,ROW()-1,\"\")","v":""},"",""]
[{"$f":"IFERROR(Requirment[[#This Row],[Scenarios_reference]],\"\")","v":"__"},70,{"$f":"IF(COUNTIF($A$2:A71,A71)=1,ROW()-1,\"\")","v":""},"","",{"$f":"IFERROR(Requirment[[#This Row],[Formula_Name]],\"\")","v":0},70,{"$f":"IF(COUNTIF($F$2:F71,F71)=1,ROW()-1,\"\")","v":""},"",""]
[{"$f":"IFERROR(Requirment[[#This Row],[Scenarios_reference]],\"\")","v":"__"},71,{"$f":"IF(COUNTIF($A$2:A72,A72)=1,ROW()-1,\"\")","v":""},"","",{"$f":"IFERROR(Requirment[[#This Row],[Formula_Name]],\"\")","v":0},71,{"$f":"IF(COUNTIF($F$2:F72,F72)=1,ROW()-1,\"\")","v":""},"",""]
[{"$f":"IFERROR(Requirment[[#This Row],[Scenarios_reference]],\"\")","v":"__"},72,{"$f":"IF(COUNTIF($A$2:A73,A73)=1,ROW()-1,\"\")","v":""},"","",{"$f":"IFERROR(Requirment[[#This Row],[Formula_Name]],\"\")","v":0},72,{"$f":"IF(COUNTIF($F$2:F73,F73)=1,ROW()-1,\"\")","v":""},"",""]
[{"$f":"IFERROR(Requirment[[#This Row],[Scenarios_reference]],\"\")","v":"__"},73,{"$f":"IF(COUNTIF($A$2:A74,A74)=1,ROW()-1,\"\")","v":""},"","",{"$f":"IFERROR(Requirment[[#This Row],[Formula_Name]],\"\")","v":0},73,{"$f":"IF(COUNTIF($F$2:F74,F74)=1,ROW()-1,\"\")","v":""},"",""]
[{"$f":"IFERROR(Requirment[[#This Row],[Scenarios_reference]],\"\")","v":"__"},74,{"$f":"IF(COUNTIF($A$2:A75,A75)=1,ROW()-1,\"\")","v":""},"","",{"$f":"IFERROR(Requirment[[#This Row],[Formula_Name]],\"\")","v":0},74,{"$f":"IF(COUNTIF($F$2:F75,F75)=1,ROW()-1,\"\")","v":""},"",""]
[{"$f":"IFERROR(Requirment[[#This Row],[Scenarios_reference]],\"\")","v":"__"},75,{"$f":"IF(COUNTIF($A$2:A76,A76)=1,ROW()-1,\"\")","v":""},"","",{"$f":"IFERROR(Requirment[[#This Row],[Formula_Name]],\"\")","v":0},75,{"$f":"IF(COUNTIF($F$2:F76,F76)=1,ROW()-1,\"\")","v":""},"",""]
[{"$f":"IFERROR(Requirment[[#This Row],[Scenarios_reference]],\"\")","v":"__"},76,{"$f":"IF(COUNTIF($A$2:A77,A77)=1,ROW()-1,\"\")","v":""},"","",{"$f":"IFERROR(Requirment[[#This Row],[Formula_Name]],\"\")","v":0},76,{"$f":"IF(COUNTIF($F$2:F77,F77)=1,ROW()-1,\"\")","v":""},"",""]
[{"$f":"IFERROR(Requirment[[#This Row],[Scenarios_reference]],\"\")","v":"__"},77,{"$f":"IF(COUNTIF($A$2:A78,A78)=1,ROW()-1,\"\")","v":""},"","",{"$f":"IFERROR(Requirment[[#This Row],[Formula_Name]],\"\")","v":0},77,{"$f":"IF(COUNTIF($F$2:F78,F78)=1,ROW()-1,\"\")","v":""},"",""]
[{"$f":"IFERROR(Requirment[[#This Row],[Scenarios_reference]],\"\")","v":"__"},78,{"$f":"IF(COUNTIF($A$2:A79,A79)=1,ROW()-1,\"\")","v":""},"","",{"$f":"IFERROR(Requirment[[#This Row],[Formula_Name]],\"\")","v":0},78,{"$f":"IF(COUNTIF($F$2:F79,F79)=1,ROW()-1,\"\")","v":""},"",""]
[{"$f":"IFERROR(Requirment[[#This Row],[Scenarios_reference]],\"\")","v":"__"},79,{"$f":"IF(COUNTIF($A$2:A80,A80)=1,ROW()-1,\"\")","v":""},"","",{"$f":"IFERROR(Requirment[[#This Row],[Formula_Name]],\"\")","v":0},79,{"$f":"IF(COUNTIF($F$2:F80,F80)=1,ROW()-1,\"\")","v":""},"",""]
[{"$f":"IFERROR(Requirment[[#This Row],[Scenarios_reference]],\"\")","v":"__"},80,{"$f":"IF(COUNTIF($A$2:A81,A81)=1,ROW()-1,\"\")","v":""},"","",{"$f":"IFERROR(Requirment[[#This Row],[Formula_Name]],\"\")","v":0},80,{"$f":"IF(COUNTIF($F$2:F81,F81)=1,ROW()-1,\"\")","v":""},"",""]
[{"$f":"IFERROR(Requirment[[#This Row],[Scenarios_reference]],\"\")","v":"__"},81,{"$f":"IF(COUNTIF($A$2:A82,A82)=1,ROW()-1,\"\")","v":""},"","",{"$f":"IFERROR(Requirment[[#This Row],[Formula_Name]],\"\")","v":0},81,{"$f":"IF(COUNTIF($F$2:F82,F82)=1,ROW()-1,\"\")","v":""},"",""]
[{"$f":"IFERROR(Requirment[[#This Row],[Scenarios_reference]],\"\")","v":"__"},82,{"$f":"IF(COUNTIF($A$2:A83,A83)=1,ROW()-1,\"\")","v":""},"","",{"$f":"IFERROR(Requirment[[#This Row],[Formula_Name]],\"\")","v":0},82,{"$f":"IF(COUNTIF($F$2:F83,F83)=1,ROW()-1,\"\")","v":""},"",""]
[{"$f":"IFERROR(Requirment[[#This Row],[Scenarios_reference]],\"\")","v":"__"},83,{"$f":"IF(COUNTIF($A$2:A84,A84)=1,ROW()-1,\"\")","v":""},"","",{"$f":"IFERROR(Requirment[[#This Row],[Formula_Name]],\"\")","v":0},83,{"$f":"IF(COUNTIF($F$2:F84,F84)=1,ROW()-1,\"\")","v":""},"",""]
[{"$f":"IFERROR(Requirment[[#This Row],[Scenarios_reference]],\"\")","v":"__"},84,{"$f":"IF(COUNTIF($A$2:A85,A85)=1,ROW()-1,\"\")","v":""},"","",{"$f":"IFERROR(Requirment[[#This Row],[Formula_Name]],\"\")","v":0},84,{"$f":"IF(COUNTIF($F$2:F85,F85)=1,ROW()-1,\"\")","v":""},"",""]
[{"$f":"IFERROR(Requirment[[#This Row],[Scenarios_reference]],\"\")","v":"__"},85,{"$f":"IF(COUNTIF($A$2:A86,A86)=1,ROW()-1,\"\")","v":""},"","",{"$f":"IFERROR(Requirment[[#This Row],[Formula_Name]],\"\")","v":0},85,{"$f":"IF(COUNTIF($F$2:F86,F86)=1,ROW()-1,\"\")","v":""},"",""]
[{"$f":"IFERROR(Requirment[[#This Row],[Scenarios_reference]],\"\")","v":"__"},86,{"$f":"IF(COUNTIF($A$2:A87,A87)=1,ROW()-1,\"\")","v":""},"","",{"$f":"IFERROR(Requirment[[#This Row],[Formula_Name]],\"\")","v":0},86,{"$f":"IF(COUNTIF($F$2:F87,F87)=1,ROW()-1,\"\")","v":""},"",""]
[{"$f":"IFERROR(Requirment[[#This Row],[Scenarios_reference]],\"\")","v":"__"},87,{"$f":"IF(COUNTIF($A$2:A88,A88)=1,ROW()-1,\"\")","v":""},"","",{"$f":"IFERROR(Requirment[[#This Row],[Formula_Name]],\"\")","v":0},87,{"$f":"IF(COUNTIF($F$2:F88,F88)=1,ROW()-1,\"\")","v":""},"",""]
[{"$f":"IFERROR(Requirment[[#This Row],[Scenarios_reference]],\"\")","v":"__"},88,{"$f":"IF(COUNTIF($A$2:A89,A89)=1,ROW()-1,\"\")","v":""},"","",{"$f":"IFERROR(Requirment[[#This Row],[Formula_Name]],\"\")","v":0},88,{"$f":"IF(COUNTIF($F$2:F89,F89)=1,ROW()-1,\"\")","v":""},"",""]
[{"$f":"IFERROR(Requirment[[#This Row],[Scenarios_reference]],\"\")","v":"__"},89,{"$f":"IF(COUNTIF($A$2:A90,A90)=1,ROW()-1,\"\")","v":""},"","",{"$f":"IFERROR(Requirment[[#This Row],[Formula_Name]],\"\")","v":0},89,{"$f":"IF(COUNTIF($F$2:F90,F90)=1,ROW()-1,\"\")","v":""},"",""]
[{"$f":"IFERROR(Requirment[[#This Row],[Scenarios_reference]],\"\")","v":"__"},90,{"$f":"IF(COUNTIF($A$2:A91,A91)=1,ROW()-1,\"\")","v":""},"","",{"$f":"IFERROR(Requirment[[#This Row],[Formula_Name]],\"\")","v":0},90,{"$f":"IF(COUNTIF($F$2:F91,F91)=1,ROW()-1,\"\")","v":""},"",""]
[{"$f":"IFERROR(Requirment[[#This Row],[Scenarios_reference]],\"\")","v":"__"},91,{"$f":"IF(COUNTIF($A$2:A92,A92)=1,ROW()-1,\"\")","v":""},"","",{"$f":"IFERROR(Requirment[[#This Row],[Formula_Name]],\"\")","v":0},91,{"$f":"IF(COUNTIF($F$2:F92,F92)=1,ROW()-1,\"\")","v":""},"",""]
[{"$f":"IFERROR(Requirment[[#This Row],[Scenarios_reference]],\"\")","v":"__"},92,{"$f":"IF(COUNTIF($A$2:A93,A93)=1,ROW()-1,\"\")","v":""},"","",{"$f":"IFERROR(Requirment[[#This Row],[Formula_Name]],\"\")","v":0},92,{"$f":"IF(COUNTIF($F$2:F93,F93)=1,ROW()-1,\"\")","v":""},"",""]
[{"$f":"IFERROR(Requirment[[#This Row],[Scenarios_reference]],\"\")","v":"__"},93,{"$f":"IF(COUNTIF($A$2:A94,A94)=1,ROW()-1,\"\")","v":""},"","",{"$f":"IFERROR(Requirment[[#This Row],[Formula_Name]],\"\")","v":0},93,{"$f":"IF(COUNTIF($F$2:F94,F94)=1,ROW()-1,\"\")","v":""},"",""]
[{"$f":"IFERROR(Requirment[[#This Row],[Scenarios_reference]],\"\")","v":"__"},94,{"$f":"IF(COUNTIF($A$2:A95,A95)=1,ROW()-1,\"\")","v":""},"","",{"$f":"IFERROR(Requirment[[#This Row],[Formula_Name]],\"\")","v":0},94,{"$f":"IF(COUNTIF($F$2:F95,F95)=1,ROW()-1,\"\")","v":""},"",""]
[{"$f":"IFERROR(Requirment[[#This Row],[Scenarios_reference]],\"\")","v":"__"},95,{"$f":"IF(COUNTIF($A$2:A96,A96)=1,ROW()-1,\"\")","v":""},"","",{"$f":"IFERROR(Requirment[[#This Row],[Formula_Name]],\"\")","v":0},95,{"$f":"IF(COUNTIF($F$2:F96,F96)=1,ROW()-1,\"\")","v":""},"",""]
[{"$f":"IFERROR(Requirment[[#This Row],[Scenarios_reference]],\"\")","v":"__"},96,{"$f":"IF(COUNTIF($A$2:A97,A97)=1,ROW()-1,\"\")","v":""},"","",{"$f":"IFERROR(Requirment[[#This Row],[Formula_Name]],\"\")","v":0},96,{"$f":"IF(COUNTIF($F$2:F97,F97)=1,ROW()-1,\"\")","v":""},"",""]
[{"$f":"IFERROR(Requirment[[#This Row],[Scenarios_reference]],\"\")","v":"__"},97,{"$f":"IF(COUNTIF($A$2:A98,A98)=1,ROW()-1,\"\")","v":""},"","",{"$f":"IFERROR(Requirment[[#This Row],[Formula_Name]],\"\")","v":0},97,{"$f":"IF(COUNTIF($F$2:F98,F98)=1,ROW()-1,\"\")","v":""},"",""]
[{"$f":"IFERROR(Requirment[[#This Row],[Scenarios_reference]],\"\")","v":"__"},98,{"$f":"IF(COUNTIF($A$2:A99,A99)=1,ROW()-1,\"\")","v":""},"","",{"$f":"IFERROR(Requirment[[#This Row],[Formula_Name]],\"\")","v":0},98,{"$f":"IF(COUNTIF($F$2:F99,F99)=1,ROW()-1,\"\")","v":""},"",""]
[{"$f":"IFERROR(Requirment[[#This Row],[Scenarios_reference]],\"\")","v":"__"},99,{"$f":"IF(COUNTIF($A$2:A100,A100)=1,ROW()-1,\"\")","v":""},"","",{"$f":"IFERROR(Requirment[[#This Row],[Formula_Name]],\"\")","v":0},99,{"$f":"IF(COUNTIF($F$2:F100,F100)=1,ROW()-1,\"\")","v":""},"",""]

{"sheet":"About","index":8,"n_rows":0,"n_cols":0,"rows_kept":0}

{"sheet":"References","index":9,"n_rows":0,"n_cols":0,"rows_kept":0}