{"text_format":"3","workbook":"xlsx","n_sheets":10,"sheets":["Impressum","Tool","Database_Feedstuffs","Swine_needs","Roughage_Forage","PDF_Export","About","References","Contribution","List_sheet"],"not_rendered":{"charts":5,"images":10,"macros":1,"external_links":1,"defined_names":70},"read":"whole","date_system":"1900"}

{"sheet":"Impressum","index":0,"n_rows":0,"n_cols":0,"rows_kept":0}

{"sheet":"Tool","index":1,"n_rows":33,"n_cols":42,"rows_kept":33,"merged":[[2,4,2,7],[2,13,2,15],[2,16,2,21],[3,4,3,7],[3,13,3,15],[3,16,3,21],[4,4,4,7],[4,13,4,15],[4,16,4,21],[5,4,5,7],[5,13,5,15],[5,16,5,21],[6,4,6,7],[7,4,7,7]]}
[]
[]
[{"$nulls":3},"Identity of the farm:","Mr example",{"$nulls":8},"Scenario",null,null,"Gestating sow red clover silage 1 kg"]
[{"$nulls":3},"Farmer's name:","Guido",{"$nulls":8},"Feeding phase",null,null,"Finisher"]
[{"$nulls":3},"Date:","2020-12-10",{"$nulls":3},{"$f":"TEXT(E5,\"aaaammjj\")","v":"20201210"},{"$nulls":4},"Category of animal",null,null,{"$f":"_xlfn.IFNA(VLOOKUP($Q$10,Requirement,4,FALSE),)","v":0}]
[{"$nulls":3},"Objectives(Kg)",100,{"$nulls":8},"Weight/age",null,null,{"$f":"_xlfn.IFNA(VLOOKUP($Q$10,Requirement,5,FALSE),)","v":0}]
[{"$nulls":3},"Number of phasis of feeds",2]
[{"$nulls":3},"Stage of growth",35]
{"$rows_left_out":26}
{"sheet":"Database_Feedstuffs","index":2,"n_rows":81,"n_cols":45,"rows_kept":81,"merged":[[0,0,0,2],[0,3,0,7],[0,8,0,13],[0,14,0,18],[0,19,0,24],[0,25,0,35],[0,36,0,37],[0,38,0,43]]}
[{"$nulls":3},"Main Constituents ",{"$nulls":4},"Total Amino Acid",{"$nulls":5},"Total Fatty acid",{"$nulls":4},"Total Minerals ",{"$nulls":5},"Total Energy of Pigs",{"$nulls":10},"Inclusion levels in the Pigs diet",null,"Amino Acid Digestibility"]
["Feedstuffs","Matière première","Class","DM % ","CP % ","Fiber %","FAT % ","Ash % ","LYS % ","THR % ","MET % ","MET+CYS % ","TRY % ","CYS % ","C16:0 % Fat","C18:0 % Fat","C18:1 % Fat (Oleic)","C18:2 % Fat (linoleic)","C18:3 % Fat (Alpha linolenic)","Ca % ","P % ","Na % ","Phytate P g/kg ","Mg % ","K % as fed","DE growing pig  Mj/kg ","DE Pig adult Mj/kg ","Dig. P pig (without phytase) g/kg ","ME growing pig Mj/kg ","ME growing pig (Kcal/Kg)","NE growing pig Mj/kg ","NE growing pig Kcal/kg ","ME pig adult Mj/kg ","ME pig adult Kcal/Kg","NE pig adult  Mj/kg ","NE pig adult Kcal/Kg","Piglet\n% max","Pigs and sows\n% max","DIS LYS pig % ","DIS THR pig % ","DIS MET pig % ","DIS CYS pig % ","DIS MET+CYS pig % ","DIS TRY pig % ","Source "]
["Alfalfa protein concentrate",null,"Other",{"v":92,"d":"92.0"},{"v":49.20000076293945,"d":"49.2"},{"v":2.9000000953674316,"d":"2.9"},{"v":8.199999809265137,"d":"8.2"},{"v":10.100000381469727,"d":"10.1"},{"v":2.9399999618530273,"d":"2.94"},{"v":2.339999961853027,"d":"2.34"},{"v":1,"d":"1.00"},{"v":1.4699999809265136,"d":"1.47"},0.75,{"v":0.4699999809265137,"d":"0.47"},{"v":16.600000381469727,"d":"16.6"},{"v":2.799999952316284,"d":"2.8"},{"v":7.599999904632568,"d":"7.6"},{"v":29.299999237060547,"d":"29.3"},{"v":35.79999923706055,"d":"35.8"},{"v":3.3700000762939455,"d":"3.37"},{"v":0.8399999618530274,"d":"0.84"},{"v":7.000000000000001E-3,"d":"0.01"},{"v":0.4000000059604645,"d":"0.4"},{"v":0.13999999761581422,"d":"0.14"},{"v":0.7,"d":"0.70"},{"v":15.230125523012552,"d":"15.23"},{"v":15.774058577405858,"d":"15.77"},{"v":0,"d":"0.00"},{"v":13.93305439330544,"d":"13.93"},3330,{"v":8.99581589958159,"d":"9.00"},2150,{"v":14.309623430962343,"d":"14.31"},3420,{"v":9.330543933054393,"d":"9.33"},2230,10,10,{"v":0,"d":"0.00"},{"v":0,"d":"0.00"},{"v":0,"d":"0.00"},{"v":0,"d":"0.00"},{"v":0,"d":"0.00"},{"v":0,"d":"0.00"}]
["Alfalfa, dehydrated, protein < 16% ",null,"Dehydrated forage ",{"v":92.5999984741211,"d":"92.6"},{"v":13.600000381469727,"d":"13.6"},{"v":28.899999618530273,"d":"28.9"},{"v":2.200000047683716,"d":"2.2"},9.5,{"v":0.5199999809265137,"d":"0.52"},{"v":0.45999999046325685,"d":"0.46"},{"v":0.1100000023841858,"d":"0.11"},{"v":0.3,"d":"0.30"},{"v":0.1899999976158142,"d":"0.19"},{"v":0.1899999976158142,"d":"0.19"},{"v":16.600000381469727,"d":"16.6"},{"v":2.799999952316284,"d":"2.8"},{"v":7.599999904632568,"d":"7.6"},{"v":29.299999237060547,"d":"29.3"},{"v":35.79999923706055,"d":"35.8"},{"v":1.7700000762939454,"d":"1.77"},{"v":0.24000000953674316,"d":"0.24"},{"v":0.05600000023841858,"d":"0.06"},{"v":0.10000000149011612,"d":"0.1"},{"v":0.1899999976158142,"d":"0.19"},{"v":2.3,"d":"2.30"},{"v":7.2803347280334725,"d":"7.28"},{"v":7.949790794979079,"d":"7.95"},{"v":0.699999988079071,"d":"0.70"},{"v":6.820083682008368,"d":"6.82"},1630,{"v":3.723849372384937,"d":"3.72"},890,{"v":7.196652719665272,"d":"7.20"},1720,{"v":4.01673640167364,"d":"4.02"},960,{"v":0,"d":"0.00"},10,0.2700000047683716,0.27999999523162844,0.0800000011920929,0.06000000238418579,0.13999999761581422,0.0899999976158142,"Organic table  (ITAB &AFZ)"]
["Alfalfa, dehydrated, protein 16-18% ",null,"Dehydrated forage ",{"v":91.9000015258789,"d":"91.9"},{"v":15.600000381469727,"d":"15.6"},26.5,{"v":2.200000047683716,"d":"2.2"},{"v":9.800000190734863,"d":"9.8"},{"v":0.6599999904632569,"d":"0.66"},{"v":0.5699999809265137,"d":"0.57"},{"v":0.1600000023841858,"d":"0.16"},{"v":0.3599999904632568,"d":"0.36"},{"v":0.2200000047683716,"d":"0.22"},{"v":0.2,"d":"0.20"},{"v":16.600000381469727,"d":"16.6"},{"v":2.799999952316284,"d":"2.8"},{"v":7.599999904632568,"d":"7.6"},{"v":29.299999237060547,"d":"29.3"},{"v":35.79999923706055,"d":"35.8"},2.05,{"v":0.22999999523162842,"d":"0.23"},{"v":0.033000001311302186,"d":"0.03"},{"v":0.10000000149011612,"d":"0.1"},{"v":0.1799999952316284,"d":"0.18"},{"v":2.3799999237060545,"d":"2.38"},{"v":7.573221757322176,"d":"7.57"},{"v":8.200836820083682,"d":"8.20"},{"v":1,"d":"1.00"},{"v":7.071129707112971,"d":"7.07"},1690,{"v":3.933054393305439,"d":"3.93"},940,{"v":7.447698744769874,"d":"7.45"},1780,{"v":4.2259414225941425,"d":"4.23"},1010.0000000000001,{"v":0,"d":"0.00"},10,0.3700000047683716,0.3599999904632568,0.12000000476837158,0.06999999880790711,0.1899999976158142,0.1,"Organic table  (ITAB &AFZ)"]
["Alfalfa, dehydrated, protein 17-19% ",null,"Dehydrated forage ",{"v":92.0999984741211,"d":"92.1"},{"v":16.399999618530273,"d":"16.4"},{"v":25.399999618530273,"d":"25.4"},{"v":2.299999952316284,"d":"2.3"},{"v":10,"d":"10.0"},{"v":0.7199999809265136,"d":"0.72"},{"v":0.6099999904632568,"d":"0.61"},{"v":0.1799999952316284,"d":"0.18"},{"v":0.3900000095367432,"d":"0.39"},{"v":0.22999999523162842,"d":"0.23"},{"v":0.20999999046325685,"d":"0.21"},{"v":16.600000381469727,"d":"16.6"},{"v":2.799999952316284,"d":"2.8"},{"v":7.599999904632568,"d":"7.6"},{"v":29.299999237060547,"d":"29.3"},{"v":35.79999923706055,"d":"35.8"},{"v":1.8799999237060547,"d":"1.88"},{"v":0.24000000953674316,"d":"0.24"},{"v":0.03899999856948853,"d":"0.04"},{"v":0.10000000149011612,"d":"0.1"},{"v":0.1899999976158142,"d":"0.19"},{"v":2.220000076293945,"d":"2.22"},{"v":7.7405857740585775,"d":"7.74"},{"v":8.368200836820083,"d":"8.37"},{"v":0.8999999761581421,"d":"0.90"},{"v":7.196652719665272,"d":"7.20"},1720,{"v":4.058577405857741,"d":"4.06"},970.0000000000001,{"v":7.573221757322176,"d":"7.57"},1810,{"v":4.351464435146443,"d":"4.35"},1040,{"v":0,"d":"0.00"},10,0.40999999046325686,0.3900000095367432,0.13999999761581422,0.06999999880790711,0.20999999046325685,0.1100000023841858,"Organic table  (ITAB &AFZ)"]
["Alfalfa, dehydrated, protein 19-22% ",null,"Dehydrated forage ",{"v":92,"d":"92.0"},{"v":18.600000381469727,"d":"18.6"},{"v":23.600000381469727,"d":"23.6"},{"v":2.799999952316284,"d":"2.8"},{"v":10.600000381469727,"d":"10.6"},{"v":0.8600000381469727,"d":"0.86"},{"v":0.7199999809265136,"d":"0.72"},{"v":0.22999999523162842,"d":"0.23"},{"v":0.45999999046325685,"d":"0.46"},{"v":0.25999999046325684,"d":"0.26"},{"v":0.22999999523162842,"d":"0.23"},{"v":16.600000381469727,"d":"16.6"},{"v":2.799999952316284,"d":"2.8"},{"v":7.599999904632568,"d":"7.6"},{"v":29.299999237060547,"d":"29.3"},{"v":35.79999923706055,"d":"35.8"},{"v":2,"d":"2.00"},{"v":0.24000000953674316,"d":"0.24"},{"v":0.04000000059604645,"d":"0.04"},{"v":0.10000000149011612,"d":"0.1"},{"v":0.1899999976158142,"d":"0.19"},{"v":2.3,"d":"2.30"},{"v":8.03347280334728,"d":"8.03"},{"v":8.619246861924687,"d":"8.62"},{"v":0.800000011920929,"d":"0.80"},{"v":7.489539748953975,"d":"7.49"},1790,{"v":4.2677824267782425,"d":"4.27"},1020,{"v":0,"d":"0.00"},0,{"v":4.560669456066946,"d":"4.56"},1090,{"v":0,"d":"0.00"},10,0.5300000190734864,0.4699999809265137,0.1799999952316284,0.0800000011920929,0.25999999046325684,0.12000000476837158,"Organic table  (ITAB &AFZ)"]
["Apple Pulp (Dried)",null,"Other plant product ",{"v":91,"d":"91.0"},7.3,26.4,{"v":3,"d":"3.0"},2.1,0.31,0.23,0.11,0.18,0.08,0.07,3.5,0.3,1.2,14.4,1.9,0.09,0.12,0.26,{"v":0.07,"d":"0.1"},{"v":0.006,"d":"0.01"},{"v":0.3,"d":"0.30"},{"v":8.9,"d":"8.90"},{"v":10.1,"d":"10.10"},{"v":0,"d":"0.00"},{"v":8.5,"d":"8.50"},2020,{"v":5.2,"d":"5.20"},1250,{"v":9.3,"d":"9.30"},2230,{"v":5.9,"d":"5.90"},1410,{"v":0,"d":"0.00"},{"v":0,"d":"0.00"},0.18,0.14,0.08,0.04,0.13,0.05,"Feedtable (INRA)"]
{"$rows_left_out":74}
{"sheet":"Swine_needs","index":3,"n_rows":100,"n_cols":46,"rows_kept":100}
["Obj_reference","Scénarios","Swine requiment ","Type of animals to select inclusing levels","Weight/Age","ME objective (MJ or g/kg)","ME Max ","NE objective (MJ or g/kg)","NE max","CP min","Cp max","Fiber Min ","Fiber max","Fat min","Fat Max","Ca min","Ca max","P min","P max ","P avail","Na min","Na max","Tot Lys min","Tot Lys max","Lys Dig min","Lys Dig max","Met tot min","met tot max","Met Dig min","Met Dig Max","TRY tot min","Try tot max","Try Dig min","Try Dig max","Met+Cys tot min","Met+Cys tot max","Met+Cys Dig min","Met+Cys Dig Max","Thr tot min","Thr tot max","Thr Dig min","Thr Dig max","ME growing pigs min","ME growing pigs max","NE growing pigs min","NE growing pigs max"]
[{"$f":"B2&\"_\"&C2","v":"Pigs_2_Phasis_Grower"},"Pigs_2_Phasis","Grower","Pigs and sows","35 - 70 kg",12.4,{"v":13.899999999999999,"d":"13.9"},{"v":9,"d":"9.0"},10.5,{"v":17,"d":"17.0"},18.5,{"v":2,"d":"2.0"},3.5,{"v":1,"d":"1.0"},2.5,{"v":6,"d":"6.0"},7.5,{"v":4,"d":"4.0"},5.5,2.3,0.5,{"v":2,"d":"2.0"},{"v":9,"d":"9.0"},10.5,{"v":7.6499999999999995,"d":"7.7"},{"v":8.924999999999999,"d":"8.9"},{"v":2.6999999999999997,"d":"2.7"},{"v":3.15,"d":"3.2"},{"v":2.295,"d":"2.3"},{"v":2.6774999999999998,"d":"2.7"},{"v":1.71,"d":"1.7"},{"v":1.995,"d":"2.0"},{"v":1.4535,"d":"1.5"},{"v":1.6957499999999999,"d":"1.7"},{"v":5.8500000000000005,"d":"5.9"},{"v":6.825,"d":"6.8"},{"v":4.9725,"d":"5.0"},{"v":5.80125,"d":"5.8"},{"v":6.57,"d":"6.6"},{"v":7.665,"d":"7.7"},{"v":5.584499999999999,"d":"5.6"},{"v":6.515249999999999,"d":"6.5"},{"v":0,"d":"0.0"},{"v":100,"d":"100.0"},{"v":0,"d":"0.0"},{"v":100,"d":"100.0"}]
["Pigs_2_Phasis_Weaners","Pigs_2_Phasis","Weaners","Piglets","< 35 kg",12.4,{"v":13.899999999999999,"d":"13.9"},{"v":9,"d":"9.0"},10.5,{"v":15,"d":"15.0"},16.5,{"v":4,"d":"4.0"},5.5,{"v":3,"d":"3.0"},4.5,{"v":5,"d":"5.0"},6.5,{"v":4,"d":"4.0"},5.5,3.2,1.5,{"v":3,"d":"3.0"},{"v":10,"d":"10.0"},11.5,8.5,{"v":9.775,"d":"9.8"},{"v":3,"d":"3.0"},{"v":3.4499999999999997,"d":"3.5"},{"v":2.55,"d":"2.6"},{"v":2.9325,"d":"2.9"},1.9,{"v":2.185,"d":"2.2"},{"v":1.615,"d":"1.6"},{"v":1.85725,"d":"1.9"},6.5,{"v":7.4750000000000005,"d":"7.5"},{"v":5.525,"d":"5.5"},{"v":6.353750000000001,"d":"6.4"},7.3,{"v":8.395,"d":"8.4"},{"v":6.205,"d":"6.2"},{"v":7.13575,"d":"7.1"},{"v":0,"d":"0.0"},{"v":100,"d":"100.0"},{"v":0,"d":"0.0"},{"v":100,"d":"100.0"}]
["Pigs_3_Phasis_Weaners","Pigs_3_Phasis","Weaners","Piglets","< 35 kg",{"v":12,"d":"12.0"},13.5,9.5,{"v":11,"d":"11.0"},{"v":17,"d":"17.0"},18.5,{"v":2,"d":"2.0"},3.5,{"v":3,"d":"3.0"},4.5,{"v":6,"d":"6.0"},7.5,{"v":5,"d":"5.0"},6.5,3.2,0.5,{"v":2,"d":"2.0"},{"v":11,"d":"11.0"},12.5,{"v":9.35,"d":"9.4"},{"v":10.625,"d":"10.6"},3.3,{"v":3.75,"d":"3.8"},{"v":2.8049999999999997,"d":"2.8"},{"v":3.1875,"d":"3.2"},{"v":2.09,"d":"2.1"},{"v":2.375,"d":"2.4"},{"v":1.7765,"d":"1.8"},{"v":2.01875,"d":"2.0"},{"v":7.15,"d":"7.2"},{"v":8.125,"d":"8.1"},{"v":6.0775,"d":"6.1"},{"v":6.90625,"d":"6.9"},{"v":8.03,"d":"8.0"},{"v":9.125,"d":"9.1"},{"v":6.8255,"d":"6.8"},{"v":7.75625,"d":"7.8"},{"v":0,"d":"0.0"},{"v":100,"d":"100.0"},{"v":0,"d":"0.0"},{"v":100,"d":"100.0"}]
["Pigs_3_Phasis_Grower","Pigs_3_Phasis","Grower","Pigs and sows","35 - 70 kg",12.4,{"v":13.899999999999999,"d":"13.9"},{"v":9,"d":"9.0"},10.5,{"v":17,"d":"17.0"},18.5,{"v":2,"d":"2.0"},3.5,{"v":1,"d":"1.0"},2.5,{"v":6,"d":"6.0"},7.5,{"v":4,"d":"4.0"},5.5,2.3,0.5,{"v":2,"d":"2.0"},{"v":9,"d":"9.0"},10.5,{"v":7.6499999999999995,"d":"7.7"},{"v":8.924999999999999,"d":"8.9"},{"v":2.6999999999999997,"d":"2.7"},{"v":3.15,"d":"3.2"},{"v":2.295,"d":"2.3"},{"v":2.6774999999999998,"d":"2.7"},{"v":1.71,"d":"1.7"},{"v":1.995,"d":"2.0"},{"v":1.4535,"d":"1.5"},{"v":1.6957499999999999,"d":"1.7"},{"v":5.8500000000000005,"d":"5.9"},{"v":6.825,"d":"6.8"},{"v":4.9725,"d":"5.0"},{"v":5.80125,"d":"5.8"},{"v":6.57,"d":"6.6"},{"v":7.665,"d":"7.7"},{"v":5.584499999999999,"d":"5.6"},{"v":6.515249999999999,"d":"6.5"},{"v":0,"d":"0.0"},{"v":100,"d":"100.0"},{"v":0,"d":"0.0"},{"v":100,"d":"100.0"}]
["Pigs_3_Phasis_Finisher","Pigs_3_Phasis","Finisher","Pigs and sows","> 75 kg",11.6,13.1,8.5,{"v":10,"d":"10.0"},{"v":13,"d":"13.0"},14.5,{"v":3,"d":"3.0"},4.5,{"v":1,"d":"1.0"},2.5,{"v":4,"d":"4.0"},5.5,{"v":3,"d":"3.0"},4.5,1.7,{"v":0,"d":"0.0"},1.5,6.5,{"v":8,"d":"8.0"},{"v":5.5249999999999995,"d":"5.5"},6.8,{"v":1.95,"d":"2.0"},2.4,{"v":1.6574999999999998,"d":"1.7"},{"v":2.04,"d":"2.0"},{"v":1.235,"d":"1.2"},{"v":1.52,"d":"1.5"},{"v":1.04975,"d":"1.0"},{"v":1.292,"d":"1.3"},{"v":4.2250000000000005,"d":"4.2"},5.2,{"v":3.5912499999999996,"d":"3.6"},{"v":4.42,"d":"4.4"},{"v":4.745,"d":"4.7"},{"v":5.84,"d":"5.8"},{"v":4.03325,"d":"4.0"},{"v":4.9639999999999995,"d":"5.0"},{"v":0,"d":"0.0"},{"v":100,"d":"100.0"},{"v":0,"d":"0.0"},{"v":100,"d":"100.0"}]
["Pigs_Fatteners_3_Phasis_Grower_1","Pigs_Fatteners_3_Phasis","Grower_1","Pigs and sows","35 - 50 kg",12.4,{"v":13.899999999999999,"d":"13.9"},{"v":9,"d":"9.0"},10.5,{"v":17,"d":"17.0"},18.5,{"v":2,"d":"2.0"},3.5,{"v":1,"d":"1.0"},2.5,{"v":6,"d":"6.0"},7.5,{"v":4,"d":"4.0"},5.5,2.3,0.5,{"v":2,"d":"2.0"},{"v":9,"d":"9.0"},10.5,{"v":7.6499999999999995,"d":"7.7"},{"v":8.924999999999999,"d":"8.9"},{"v":2.6999999999999997,"d":"2.7"},{"v":3.15,"d":"3.2"},{"v":2.295,"d":"2.3"},{"v":2.6774999999999998,"d":"2.7"},{"v":1.71,"d":"1.7"},{"v":1.995,"d":"2.0"},{"v":1.4535,"d":"1.5"},{"v":1.6957499999999999,"d":"1.7"},{"v":5.8500000000000005,"d":"5.9"},{"v":6.825,"d":"6.8"},{"v":4.9725,"d":"5.0"},{"v":5.80125,"d":"5.8"},{"v":6.57,"d":"6.6"},{"v":7.665,"d":"7.7"},{"v":5.584499999999999,"d":"5.6"},{"v":6.515249999999999,"d":"6.5"},{"v":0,"d":"0.0"},{"v":100,"d":"100.0"},{"v":0,"d":"0.0"},{"v":100,"d":"100.0"}]
["Pigs_Fatteners_3_Phasis_Grower_2","Pigs_Fatteners_3_Phasis","Grower_2","Pigs and sows","50 - 75 kg",{"v":12,"d":"12.0"},13.5,8.5,{"v":10,"d":"10.0"},{"v":15,"d":"15.0"},16.5,{"v":2,"d":"2.0"},3.5,{"v":1,"d":"1.0"},2.5,{"v":5,"d":"5.0"},6.5,3.5,{"v":5,"d":"5.0"},1.9,0.5,{"v":2,"d":"2.0"},{"v":8,"d":"8.0"},9.5,6.8,{"v":8.075,"d":"8.1"},2.4,{"v":2.85,"d":"2.9"},{"v":2.04,"d":"2.0"},{"v":2.4225,"d":"2.4"},{"v":1.52,"d":"1.5"},{"v":1.805,"d":"1.8"},{"v":1.292,"d":"1.3"},{"v":1.53425,"d":"1.5"},5.2,{"v":6.175,"d":"6.2"},{"v":4.42,"d":"4.4"},{"v":5.248749999999999,"d":"5.2"},{"v":5.84,"d":"5.8"},{"v":6.935,"d":"6.9"},{"v":4.9639999999999995,"d":"5.0"},{"v":5.894749999999999,"d":"5.9"},{"v":0,"d":"0.0"},{"v":100,"d":"100.0"},{"v":0,"d":"0.0"},{"v":100,"d":"100.0"}]
{"$rows_left_out":93}
{"sheet":"Roughage_Forage","index":4,"n_rows":30,"n_cols":42,"rows_kept":30,"merged":[[1,2,1,5],[1,11,1,13],[1,14,1,19],[2,2,2,5],[2,11,2,13],[2,14,2,19],[3,2,3,5],[3,11,3,13],[3,14,3,19],[4,2,4,5],[4,11,4,13],[4,14,4,19],[5,2,5,5],[6,2,6,5],[19,2,19,3],[20,2,20,3],[22,2,22,3],[24,2,24,3],[25,2,25,3],[26,2,26,3]]}
[]
["STEP 1 : Feeding scenario","Identity of the farm:","Mr example",{"$nulls":8},"Scenario",null,null,"Sows_2_Phasis"]
[null,"Farmer's name:","Guido",{"$nulls":8},"Feeding phase",null,null,"Gestation"]
[null,"Date:","2020-12-10",{"$nulls":3},{"$f":"TEXT(C4,\"aaaammjj\")","v":"20201210"},{"$nulls":4},"Category of animal",null,null,{"$f":"_xlfn.IFNA(VLOOKUP($O$8,Requirement,4,FALSE),)","v":"Pigs and sows"}]
[null,"Objectives(Kg)",100,{"$nulls":8},"Weight/age",null,null,{"$f":"_xlfn.IFNA(VLOOKUP($O$8,Requirement,5,FALSE),)","v":"gestation"}]
[null,"Number of phasis of feeds",2]
[null,"Stage of growth",35]
[{"$nulls":14},{"$f":"O2&\"_\"&O3","v":"Sows_2_Phasis_Gestation"}]
{"$rows_left_out":23}
{"sheet":"PDF_Export","index":5,"n_rows":53,"n_cols":7,"rows_kept":53}
[null,{"$f":"CONCATENATE(\"RATION REALIZED ON: \"&TEXT(Tool!E5,\"jj/mm/aaaa\"))","v":"RATION REALIZED ON: 10/12/2020"}]
[]
[null,"Context:"]
[null,{"$f":"Tool!D3","v":"Identity of the farm:"},{"$f":"IF(Tool!E3<>\"\",Tool!E3,\"\")","v":"Mr example"}]
[null,{"$f":"Tool!D4","v":"Farmer's name:"},{"$f":"IF(Tool!E4<>\"\",Tool!E4,\"\")","v":"Guido"}]
[null,{"$f":"Tool!D5","v":"Date:"},{"$f":"IF(Tool!E5<>\"\",Tool!E5,\"\")","v":"2020-12-10"}]
[null,{"$f":"Tool!D6","v":"Objectives(Kg)"},{"$f":"IF(Tool!E6<>\"\",Tool!E6,\"\")","v":100}]
[null,{"$f":"Tool!D7","v":"Number of phasis of feeds"},{"$f":"IF(Tool!E7<>\"\",Tool!E7,\"\")","v":2}]
{"$rows_left_out":46}
{"sheet":"About","index":6,"n_rows":0,"n_cols":0,"rows_kept":0}

{"sheet":"References","index":7,"n_rows":0,"n_cols":0,"rows_kept":0}

{"sheet":"Contribution","index":8,"n_rows":12,"n_cols":10,"rows_kept":12,"hidden":true}
["Feedstuffs - ME - Growing Pigs","% of contribution off each feedstuff for Energy (pigs)","Feedstuffs - ME - Adults","% of contribution off each feedstuff for Energy (Adults)","Feedstuffs CP","% of contribution off each feedstuff for Proteins","Feedstuffs LYS","% of contribution off each feedstuff for Lysine","Feedstuffs MET","% of contribution off each feedstuff for Methionine"]
[{"$f":"IF(B2<>0,Tool!D12,\"\")","v":{"$error":"#DIV/0!"}},{"$f":"Tool!G12*Tool!F12/Tool!$G$25","v":{"$error":"#DIV/0!"}},{"$f":"IF(D2<>0,Tool!D12,\"\")","v":{"$error":"#DIV/0!"}},{"$f":"Tool!H12*Tool!F12/Tool!$H$25","v":{"$error":"#DIV/0!"}},{"$f":"IF(F2<>0,Tool!D12,\"\")","v":{"$error":"#DIV/0!"}},{"$f":"Tool!K12*Tool!F12/Tool!$K$25","v":{"$error":"#DIV/0!"}},{"$f":"IF(H2<>0,Tool!D12,\"\")","v":{"$error":"#DIV/0!"}},{"$f":"Tool!N12*Tool!F12/Tool!$N$25*10","v":{"$error":"#DIV/0!"}},{"$f":"IF(J2<>0,Tool!D12,\"\")","v":{"$error":"#DIV/0!"}},{"$f":"Tool!P12*Tool!F12/Tool!$P$25*10","v":{"$error":"#DIV/0!"}}]
[{"$f":"IF(B3<>0,Tool!D13,\"\")","v":{"$error":"#DIV/0!"}},{"$f":"Tool!G13*Tool!F13/Tool!$G$25","v":{"$error":"#DIV/0!"}},{"$f":"IF(D3<>0,Tool!D13,\"\")","v":{"$error":"#DIV/0!"}},{"$f":"Tool!H13*Tool!F13/Tool!$H$25","v":{"$error":"#DIV/0!"}},{"$f":"IF(F3<>0,Tool!D13,\"\")","v":{"$error":"#DIV/0!"}},{"$f":"Tool!K13*Tool!F13/Tool!$K$25","v":{"$error":"#DIV/0!"}},{"$f":"IF(H3<>0,Tool!D13,\"\")","v":{"$error":"#DIV/0!"}},{"$f":"Tool!N13*Tool!F13/Tool!$N$25*10","v":{"$error":"#DIV/0!"}},{"$f":"IF(J3<>0,Tool!D13,\"\")","v":{"$error":"#DIV/0!"}},{"$f":"Tool!P13*Tool!F13/Tool!$P$25*10","v":{"$error":"#DIV/0!"}}]
[{"$f":"IF(B4<>0,Tool!D14,\"\")","v":{"$error":"#DIV/0!"}},{"$f":"Tool!G14*Tool!F14/Tool!$G$25","v":{"$error":"#DIV/0!"}},{"$f":"IF(D4<>0,Tool!D14,\"\")","v":{"$error":"#DIV/0!"}},{"$f":"Tool!H14*Tool!F14/Tool!$H$25","v":{"$error":"#DIV/0!"}},{"$f":"IF(F4<>0,Tool!D14,\"\")","v":{"$error":"#DIV/0!"}},{"$f":"Tool!K14*Tool!F14/Tool!$K$25","v":{"$error":"#DIV/0!"}},{"$f":"IF(H4<>0,Tool!D14,\"\")","v":{"$error":"#DIV/0!"}},{"$f":"Tool!N14*Tool!F14/Tool!$N$25*10","v":{"$error":"#DIV/0!"}},{"$f":"IF(J4<>0,Tool!D14,\"\")","v":{"$error":"#DIV/0!"}},{"$f":"Tool!P14*Tool!F14/Tool!$P$25*10","v":{"$error":"#DIV/0!"}}]
[{"$f":"IF(B5<>0,Tool!D15,\"\")","v":{"$error":"#DIV/0!"}},{"$f":"Tool!G15*Tool!F15/Tool!$G$25","v":{"$error":"#DIV/0!"}},{"$f":"IF(D5<>0,Tool!D15,\"\")","v":{"$error":"#DIV/0!"}},{"$f":"Tool!H15*Tool!F15/Tool!$H$25","v":{"$error":"#DIV/0!"}},{"$f":"IF(F5<>0,Tool!D15,\"\")","v":{"$error":"#DIV/0!"}},{"$f":"Tool!K15*Tool!F15/Tool!$K$25","v":{"$error":"#DIV/0!"}},{"$f":"IF(H5<>0,Tool!D15,\"\")","v":{"$error":"#DIV/0!"}},{"$f":"Tool!N15*Tool!F15/Tool!$N$25*10","v":{"$error":"#DIV/0!"}},{"$f":"IF(J5<>0,Tool!D15,\"\")","v":{"$error":"#DIV/0!"}},{"$f":"Tool!P15*Tool!F15/Tool!$P$25*10","v":{"$error":"#DIV/0!"}}]
[{"$f":"IF(B6<>0,Tool!D16,\"\")","v":{"$error":"#DIV/0!"}},{"$f":"Tool!G16*Tool!F16/Tool!$G$25","v":{"$error":"#DIV/0!"}},{"$f":"IF(D6<>0,Tool!D16,\"\")","v":{"$error":"#DIV/0!"}},{"$f":"Tool!H16*Tool!F16/Tool!$H$25","v":{"$error":"#DIV/0!"}},{"$f":"IF(F6<>0,Tool!D16,\"\")","v":{"$error":"#DIV/0!"}},{"$f":"Tool!K16*Tool!F16/Tool!$K$25","v":{"$error":"#DIV/0!"}},{"$f":"IF(H6<>0,Tool!D16,\"\")","v":{"$error":"#DIV/0!"}},{"$f":"Tool!N16*Tool!F16/Tool!$N$25*10","v":{"$error":"#DIV/0!"}},{"$f":"IF(J6<>0,Tool!D16,\"\")","v":{"$error":"#DIV/0!"}},{"$f":"Tool!P16*Tool!F16/Tool!$P$25*10","v":{"$error":"#DIV/0!"}}]
[{"$f":"IF(B7<>0,Tool!D17,\"\")","v":{"$error":"#DIV/0!"}},{"$f":"Tool!G17*Tool!F17/Tool!$G$25","v":{"$error":"#DIV/0!"}},{"$f":"IF(D7<>0,Tool!D17,\"\")","v":{"$error":"#DIV/0!"}},{"$f":"Tool!H17*Tool!F17/Tool!$H$25","v":{"$error":"#DIV/0!"}},{"$f":"IF(F7<>0,Tool!D17,\"\")","v":{"$error":"#DIV/0!"}},{"$f":"Tool!K17*Tool!F17/Tool!$K$25","v":{"$error":"#DIV/0!"}},{"$f":"IF(H7<>0,Tool!D17,\"\")","v":{"$error":"#DIV/0!"}},{"$f":"Tool!N17*Tool!F17/Tool!$N$25*10","v":{"$error":"#DIV/0!"}},{"$f":"IF(J7<>0,Tool!D17,\"\")","v":{"$error":"#DIV/0!"}},{"$f":"Tool!P17*Tool!F17/Tool!$P$25*10","v":{"$error":"#DIV/0!"}}]
[{"$f":"IF(B8<>0,Tool!D18,\"\")","v":{"$error":"#DIV/0!"}},{"$f":"Tool!G18*Tool!F18/Tool!$G$25","v":{"$error":"#DIV/0!"}},{"$f":"IF(D8<>0,Tool!D18,\"\")","v":{"$error":"#DIV/0!"}},{"$f":"Tool!H18*Tool!F18/Tool!$H$25","v":{"$error":"#DIV/0!"}},{"$f":"IF(F8<>0,Tool!D18,\"\")","v":{"$error":"#DIV/0!"}},{"$f":"Tool!K18*Tool!F18/Tool!$K$25","v":{"$error":"#DIV/0!"}},{"$f":"IF(H8<>0,Tool!D18,\"\")","v":{"$error":"#DIV/0!"}},{"$f":"Tool!N18*Tool!F18/Tool!$N$25*10","v":{"$error":"#DIV/0!"}},{"$f":"IF(J8<>0,Tool!D18,\"\")","v":{"$error":"#DIV/0!"}},{"$f":"Tool!P18*Tool!F18/Tool!$P$25*10","v":{"$error":"#DIV/0!"}}]
{"$rows_left_out":5}
{"sheet":"List_sheet","index":9,"n_rows":100,"n_cols":10,"rows_kept":100,"hidden":true}
["Valeur scenarios","Ligne","Ligne filtrée","Ligne triee","Liste unique scenarios","Valeur formula","Ligne","Ligne filtrée","Ligne triee","Liste unique Formula"]
[{"$f":"IFERROR(Table2[[#This Row],[Scénarios]],\"\")","v":"Pigs_2_Phasis"},{"$f":"ROW()-1","v":1},{"$f":"IF(COUNTIF($A$2:A2,A2)=1,ROW()-1,\"\")","v":1},{"$f":"IFERROR(SMALL(C:C,B2),\"\")","v":1},{"$f":"IFERROR(INDEX($A$2:$A$99,D2),\"\")","v":"Pigs_2_Phasis"},{"$f":"IFERROR(Table2[[#This Row],[Swine requiment ]],\"\")","v":"Grower"},{"$f":"ROW()-1","v":1},{"$f":"IF(COUNTIF($F$2:F2,F2)=1,ROW()-1,\"\")","v":1},{"$f":"IFERROR(SMALL(H:H,G2),\"\")","v":1},{"$f":"IFERROR(INDEX($F$2:$F$99,I2),\"\")","v":"Grower"}]
[{"$f":"IFERROR(Table2[[#This Row],[Scénarios]],\"\")","v":"Pigs_2_Phasis"},{"$f":"ROW()-1","v":2},{"$f":"IF(COUNTIF($A$2:A3,A3)=1,ROW()-1,\"\")","v":""},{"$f":"IFERROR(SMALL(C:C,B3),\"\")","v":3},{"$f":"IFERROR(INDEX($A$2:$A$99,D3),\"\")","v":"Pigs_3_Phasis"},{"$f":"IFERROR(Table2[[#This Row],[Swine requiment ]],\"\")","v":"Weaners"},{"$f":"ROW()-1","v":2},{"$f":"IF(COUNTIF($F$2:F3,F3)=1,ROW()-1,\"\")","v":2},{"$f":"IFERROR(SMALL(H:H,G3),\"\")","v":2},{"$f":"IFERROR(INDEX($F$2:$F$99,I3),\"\")","v":"Weaners"}]
[{"$f":"IFERROR(Table2[[#This Row],[Scénarios]],\"\")","v":"Pigs_3_Phasis"},3,{"$f":"IF(COUNTIF($A$2:A4,A4)=1,ROW()-1,\"\")","v":3},6,"Pigs_Fatteners_3_Phasis",{"$f":"IFERROR(Table2[[#This Row],[Swine requiment ]],\"\")","v":"Weaners"},3,{"$f":"IF(COUNTIF($F$2:F4,F4)=1,ROW()-1,\"\")","v":""},5,"Finisher"]
[{"$f":"IFERROR(Table2[[#This Row],[Scénarios]],\"\")","v":"Pigs_3_Phasis"},4,{"$f":"IF(COUNTIF($A$2:A5,A5)=1,ROW()-1,\"\")","v":""},9,"Multi-Phasis",{"$f":"IFERROR(Table2[[#This Row],[Swine requiment ]],\"\")","v":"Grower"},4,{"$f":"IF(COUNTIF($F$2:F5,F5)=1,ROW()-1,\"\")","v":""},6,"Grower_1"]
[{"$f":"IFERROR(Table2[[#This Row],[Scénarios]],\"\")","v":"Pigs_3_Phasis"},5,{"$f":"IF(COUNTIF($A$2:A6,A6)=1,ROW()-1,\"\")","v":""},14,"Single_Feeding",{"$f":"IFERROR(Table2[[#This Row],[Swine requiment ]],\"\")","v":"Finisher"},5,{"$f":"IF(COUNTIF($F$2:F6,F6)=1,ROW()-1,\"\")","v":5},7,"Grower_2"]
[{"$f":"IFERROR(Table2[[#This Row],[Scénarios]],\"\")","v":"Pigs_Fatteners_3_Phasis"},6,{"$f":"IF(COUNTIF($A$2:A7,A7)=1,ROW()-1,\"\")","v":6},17,"Sow_Single_Feeding",{"$f":"IFERROR(Table2[[#This Row],[Swine requiment ]],\"\")","v":"Grower_1"},6,{"$f":"IF(COUNTIF($F$2:F7,F7)=1,ROW()-1,\"\")","v":6},10,"Piglets"]
[{"$f":"IFERROR(Table2[[#This Row],[Scénarios]],\"\")","v":"Pigs_Fatteners_3_Phasis"},7,{"$f":"IF(COUNTIF($A$2:A8,A8)=1,ROW()-1,\"\")","v":""},18,"Sows_2_Phasis",{"$f":"IFERROR(Table2[[#This Row],[Swine requiment ]],\"\")","v":"Grower_2"},7,{"$f":"IF(COUNTIF($F$2:F8,F8)=1,ROW()-1,\"\")","v":7},17,"Lactation"]
{"$rows_left_out":92}