{"text_format":"3","workbook":"xlsx","n_sheets":10,"sheets":["Impressum","Tool","Database_Feedstuffs","Swine_needs","Roughage_Forage","PDF_Export","About","References","Contribution","List_sheet"],"not_rendered":{"charts":5,"images":10,"macros":1,"external_links":1,"defined_names":70},"read":"whole","date_system":"1900"}

{"sheet":"Impressum","index":0,"n_rows":0,"n_cols":0,"rows_kept":0}

{"sheet":"Tool","index":1,"n_rows":33,"n_cols":42,"rows_kept":33,"merged":[[2,4,2,7],[2,13,2,15],[2,16,2,21],[3,4,3,7],[3,13,3,15],[3,16,3,21],[4,4,4,7],[4,13,4,15],[4,16,4,21],[5,4,5,7],[5,13,5,15],[5,16,5,21],[6,4,6,7],[7,4,7,7]]}
[]
[]
[{"$nulls":3},"Identity of the farm:","Mr example",{"$nulls":8},"Scenario",null,null,"Gestating sow red clover silage 1 kg"]
[{"$nulls":3},"Farmer's name:","Guido",{"$nulls":8},"Feeding phase",null,null,"Finisher"]
[{"$nulls":3},"Date:","2020-12-10",{"$nulls":3},{"$f":"TEXT(E5,\"aaaammjj\")","v":"20201210"},{"$nulls":4},"Category of animal",null,null,{"$f":"_xlfn.IFNA(VLOOKUP($Q$10,Requirement,4,FALSE),)","v":0}]
[{"$nulls":3},"Objectives(Kg)",100,{"$nulls":8},"Weight/age",null,null,{"$f":"_xlfn.IFNA(VLOOKUP($Q$10,Requirement,5,FALSE),)","v":0}]
[{"$nulls":3},"Number of phasis of feeds",2]
[{"$nulls":3},"Stage of growth",35]
[{"$nulls":3},"Ration quantity",500,"Kg (Grinder capacity)"]
[{"$nulls":16},{"$f":"Q3&\"_\"&Q4","v":"Gestating sow red clover silage 1 kg_Finisher"}]
[{"$nulls":3},"Feedstuffs","Kg","%","ME growing pig (MJ/Kg)","NE growing pig  (MJ/Kg)","ME pig adult (MJ/Kg)","NE pig adult (MJ/Kg)","CP % raw","Fiber % raw","FAT % raw","LYS % raw","THR % raw","MET % Raw","MET+CYS % raw","TRY % raw","DIS LYS pig %  ","DIS THR pig % ","DIS MET pig % ","DIS MET+CYS pig % ","DIS   TRY   PIG% ","Ca % Raw","P % Raw","Na % Raw",null,"Optimization levels ",{"$f":"CONCATENATE(\"Inclusing Levels \",Q5)","v":"Inclusing Levels 0"},"TAKE CARE OF",null,"Feedstuffs cost (€/T)","Ration costs (€)",null,null,"C16:0 % Fat","C18:0 % Fat","C18:1 % Fat (Oleic)","C18:2 % Fat (linoleic)","C18:3 % Fat (Alpha linolenic)","Mg g/kg Raw","K g/kg as fed"]
[null,null,1,null,{"$f":"_xlfn.IFNA($E$9*F12/100,0)","v":{"v":0,"d":"0.00"}},{"v":0,"d":"0.00"},{"$f":"_xlfn.IFNA(VLOOKUP(D12,Feedstuffs,29,FALSE),0)","v":{"v":0,"d":"0.00"}},{"$f":"_xlfn.IFNA(VLOOKUP(D12,Feedstuffs,31,FALSE),0)","v":{"v":0,"d":"0.00"}},{"$f":"_xlfn.IFNA(VLOOKUP(D12,Feedstuffs,33,FALSE),0)","v":{"v":0,"d":"0.00"}},{"$f":"_xlfn.IFNA(VLOOKUP(D12,Feedstuffs,35,FALSE),0)","v":{"v":0,"d":"0.00"}},{"$f":"_xlfn.IFNA(VLOOKUP(D12,Feedstuffs,5,FALSE),0)","v":{"v":0,"d":"0.00"}},{"$f":"_xlfn.IFNA(VLOOKUP(D12,Feedstuffs,6,),0)","v":{"v":0,"d":"0.00"}},{"$f":"_xlfn.IFNA(VLOOKUP(D12,Feedstuffs,7,FALSE),0)","v":{"v":0,"d":"0.00"}},{"$f":"_xlfn.IFNA(VLOOKUP(D12,Feedstuffs,9,FALSE),0)","v":{"v":0,"d":"0.00"}},{"$f":"_xlfn.IFNA(VLOOKUP(D12,Feedstuffs,10,FALSE),0)","v":{"v":0,"d":"0.00"}},{"$f":"_xlfn.IFNA(VLOOKUP(D12,Feedstuffs,11,FALSE),0)","v":{"v":0,"d":"0.00"}},{"$f":"_xlfn.IFNA(VLOOKUP(D12,Feedstuffs,12,FALSE),0)","v":{"v":0,"d":"0.00"}},{"$f":"_xlfn.IFNA(VLOOKUP(D12,Feedstuffs,13,FALSE),0)","v":{"v":0,"d":"0.00"}},{"$f":"_xlfn.IFNA(VLOOKUP(D12,Feedstuffs,39,FALSE),0)","v":{"v":0,"d":"0.00"}},{"$f":"_xlfn.IFNA(VLOOKUP(D12,Feedstuffs,40,FALSE),0)","v":{"v":0,"d":"0.00"}},{"$f":"_xlfn.IFNA(VLOOKUP(D12,Feedstuffs,41,FALSE),0)","v":{"v":0,"d":"0.00"}},{"$f":"_xlfn.IFNA(VLOOKUP(D12,Feedstuffs,43,FALSE),0)","v":{"v":0,"d":"0.00"}},{"$f":"_xlfn.IFNA(VLOOKUP(D12,Feedstuffs,44,FALSE),0)","v":{"v":0,"d":"0.00"}},{"$f":"_xlfn.IFNA(VLOOKUP(D12,Feedstuffs,20,FALSE),0)","v":{"v":0,"d":"0.00"}},{"$f":"_xlfn.IFNA(VLOOKUP(D12,Feedstuffs,21,FALSE),0)","v":{"v":0,"d":"0.00"}},{"$f":"_xlfn.IFNA(VLOOKUP(D12,Feedstuffs,22,FALSE),0)","v":{"v":0,"d":"0.00"}},null,{"v":0,"d":"0.00"},{"$f":"_xlfn.IFNA(IF($Q$5=\"Piglets\",(VLOOKUP(D12,Feedstuffs,37,FALSE)),IF($Q$5=\"Pigs and sows\",(VLOOKUP(D12,Feedstuffs,38,FALSE)))),\"\")","v":false},{"$f":"IF(D12<>\"\",IF($E$11=\"%\",IF(E12>AC12,\"SUP\",IF(E12=AC12,\"MAX\",\"OK\")),IF(F12>AC12,\"HIGH\",IF(F12=AC12,\"MAX\",\"OK\"))),\"\")","v":""},null,0,{"$f":"E12*AF12/1000","v":0},{"$f":"F12*AF12/$AG$27","v":{"$error":"#DIV/0!"}},null,{"$f":"_xlfn.IFNA(VLOOKUP(D12,Feedstuffs,15,FALSE),0)","v":{"v":0,"d":"0.00"}},{"$f":"_xlfn.IFNA(VLOOKUP(D12,Feedstuffs,16,FALSE),0)","v":{"v":0,"d":"0.00"}},{"$f":"_xlfn.IFNA(VLOOKUP(D12,Feedstuffs,17,FALSE),0)","v":{"v":0,"d":"0.00"}},{"$f":"_xlfn.IFNA(VLOOKUP(D12,Feedstuffs,18,FALSE),0)","v":{"v":0,"d":"0.00"}},{"$f":"_xlfn.IFNA(VLOOKUP(D12,Feedstuffs,19,FALSE),0)","v":{"v":0,"d":"0.00"}},{"$f":"_xlfn.IFNA(VLOOKUP(D12,Feedstuffs,24,FALSE),0)","v":{"v":0,"d":"0.00"}},{"$f":"_xlfn.IFNA(VLOOKUP(D12,Feedstuffs,25,FALSE),0)","v":{"v":0,"d":"0.00"}}]
[null,null,2,null,{"$f":"_xlfn.IFNA($E$9*F13/100,0)","v":{"v":0,"d":"0.00"}},{"v":0,"d":"0.00"},{"v":0,"d":"0.00"},{"v":0,"d":"0.00"},{"v":0,"d":"0.00"},{"v":0,"d":"0.00"},{"v":0,"d":"0.00"},{"v":0,"d":"0.00"},{"v":0,"d":"0.00"},{"v":0,"d":"0.00"},{"v":0,"d":"0.00"},{"v":0,"d":"0.00"},{"v":0,"d":"0.00"},{"v":0,"d":"0.00"},{"v":0,"d":"0.00"},{"v":0,"d":"0.00"},{"v":0,"d":"0.00"},{"v":0,"d":"0.00"},{"v":0,"d":"0.00"},{"$f":"_xlfn.IFNA(VLOOKUP(D13,Feedstuffs,20,FALSE),0)","v":{"v":0,"d":"0.00"}},{"v":0,"d":"0.00"},{"$f":"_xlfn.IFNA(VLOOKUP(D13,Feedstuffs,22,FALSE),0)","v":{"v":0,"d":"0.00"}},null,{"v":0,"d":"0.00"},{"$f":"_xlfn.IFNA(IF($Q$5=\"Piglets\",(VLOOKUP(D13,Feedstuffs,37,FALSE)),IF($Q$5=\"Pigs and sows\",(VLOOKUP(D13,Feedstuffs,38,FALSE)))),\"\")","v":false},{"$f":"IF(D13<>\"\",IF($E$11=\"%\",IF(E13>AC13,\"SUP\",IF(E13=AC13,\"MAX\",\"OK\")),IF(F13>AC13,\"HIGH\",IF(F13=AC13,\"MAX\",\"OK\"))),\"\")","v":""},null,0,{"$f":"E13*AF13/1000","v":0},{"$error":"#DIV/0!"},null,{"v":0,"d":"0.00"},{"v":0,"d":"0.00"},{"v":0,"d":"0.00"},{"v":0,"d":"0.00"},{"v":0,"d":"0.00"},{"v":0,"d":"0.00"},{"v":0,"d":"0.00"}]
[null,null,3,null,{"v":0,"d":"0.00"},{"v":0,"d":"0.00"},{"v":0,"d":"0.00"},{"v":0,"d":"0.00"},{"v":0,"d":"0.00"},{"v":0,"d":"0.00"},{"v":0,"d":"0.00"},{"v":0,"d":"0.00"},{"v":0,"d":"0.00"},{"v":0,"d":"0.00"},{"v":0,"d":"0.00"},{"v":0,"d":"0.00"},{"v":0,"d":"0.00"},{"v":0,"d":"0.00"},{"v":0,"d":"0.00"},{"v":0,"d":"0.00"},{"v":0,"d":"0.00"},{"v":0,"d":"0.00"},{"v":0,"d":"0.00"},{"v":0,"d":"0.00"},{"v":0,"d":"0.00"},{"v":0,"d":"0.00"},null,{"v":0,"d":"0.00"},false,"",null,0,0,{"$error":"#DIV/0!"},null,{"v":0,"d":"0.00"},{"v":0,"d":"0.00"},{"v":0,"d":"0.00"},{"v":0,"d":"0.00"},{"v":0,"d":"0.00"},{"v":0,"d":"0.00"},{"v":0,"d":"0.00"}]
[null,null,4,null,{"v":0,"d":"0.00"},{"v":0,"d":"0.00"},{"v":0,"d":"0.00"},{"v":0,"d":"0.00"},{"v":0,"d":"0.00"},{"v":0,"d":"0.00"},{"v":0,"d":"0.00"},{"v":0,"d":"0.00"},{"v":0,"d":"0.00"},{"v":0,"d":"0.00"},{"v":0,"d":"0.00"},{"v":0,"d":"0.00"},{"v":0,"d":"0.00"},{"v":0,"d":"0.00"},{"v":0,"d":"0.00"},{"v":0,"d":"0.00"},{"v":0,"d":"0.00"},{"v":0,"d":"0.00"},{"v":0,"d":"0.00"},{"v":0,"d":"0.00"},{"v":0,"d":"0.00"},{"v":0,"d":"0.00"},null,{"v":0,"d":"0.00"},false,"",null,0,0,{"$error":"#DIV/0!"},null,{"v":0,"d":"0.00"},{"v":0,"d":"0.00"},{"v":0,"d":"0.00"},{"v":0,"d":"0.00"},{"v":0,"d":"0.00"},{"v":0,"d":"0.00"},{"v":0,"d":"0.00"}]
[null,null,5,null,{"v":0,"d":"0.00"},{"v":0,"d":"0.00"},{"v":0,"d":"0.00"},{"v":0,"d":"0.00"},{"v":0,"d":"0.00"},{"v":0,"d":"0.00"},{"v":0,"d":"0.00"},{"v":0,"d":"0.00"},{"v":0,"d":"0.00"},{"v":0,"d":"0.00"},{"v":0,"d":"0.00"},{"v":0,"d":"0.00"},{"v":0,"d":"0.00"},{"v":0,"d":"0.00"},{"v":0,"d":"0.00"},{"v":0,"d":"0.00"},{"v":0,"d":"0.00"},{"v":0,"d":"0.00"},{"v":0,"d":"0.00"},{"v":0,"d":"0.00"},{"v":0,"d":"0.00"},{"v":0,"d":"0.00"},null,{"v":0,"d":"0.00"},false,"",null,0,0,{"$error":"#DIV/0!"},null,{"v":0,"d":"0.00"},{"v":0,"d":"0.00"},{"v":0,"d":"0.00"},{"v":0,"d":"0.00"},{"v":0,"d":"0.00"},{"v":0,"d":"0.00"},{"v":0,"d":"0.00"}]
[null,null,6,null,{"v":0,"d":"0.00"},{"v":0,"d":"0.00"},{"v":0,"d":"0.00"},{"v":0,"d":"0.00"},{"v":0,"d":"0.00"},{"v":0,"d":"0.00"},{"v":0,"d":"0.00"},{"v":0,"d":"0.00"},{"v":0,"d":"0.00"},{"v":0,"d":"0.00"},{"v":0,"d":"0.00"},{"v":0,"d":"0.00"},{"v":0,"d":"0.00"},{"v":0,"d":"0.00"},{"v":0,"d":"0.00"},{"v":0,"d":"0.00"},{"v":0,"d":"0.00"},{"v":0,"d":"0.00"},{"v":0,"d":"0.00"},{"v":0,"d":"0.00"},{"v":0,"d":"0.00"},{"v":0,"d":"0.00"},null,{"v":0,"d":"0.00"},false,"",null,0,0,{"$error":"#DIV/0!"},null,{"v":0,"d":"0.00"},{"v":0,"d":"0.00"},{"v":0,"d":"0.00"},{"v":0,"d":"0.00"},{"v":0,"d":"0.00"},{"v":0,"d":"0.00"},{"v":0,"d":"0.00"}]
[null,null,7,null,{"v":0,"d":"0.00"},{"v":0,"d":"0.00"},{"v":0,"d":"0.00"},{"v":0,"d":"0.00"},{"v":0,"d":"0.00"},{"v":0,"d":"0.00"},{"v":0,"d":"0.00"},{"v":0,"d":"0.00"},{"v":0,"d":"0.00"},{"v":0,"d":"0.00"},{"v":0,"d":"0.00"},{"v":0,"d":"0.00"},{"v":0,"d":"0.00"},{"v":0,"d":"0.00"},{"v":0,"d":"0.00"},{"v":0,"d":"0.00"},{"v":0,"d":"0.00"},{"v":0,"d":"0.00"},{"v":0,"d":"0.00"},{"v":0,"d":"0.00"},{"v":0,"d":"0.00"},{"v":0,"d":"0.00"},null,{"v":0,"d":"0.00"},false,"",null,0,0,{"$error":"#DIV/0!"},null,{"v":0,"d":"0.00"},{"v":0,"d":"0.00"},{"v":0,"d":"0.00"},{"v":0,"d":"0.00"},{"v":0,"d":"0.00"},{"v":0,"d":"0.00"},{"v":0,"d":"0.00"}]
[null,null,8,null,{"v":0,"d":"0.00"},{"v":0,"d":"0.00"},{"v":0,"d":"0.00"},{"v":0,"d":"0.00"},{"v":0,"d":"0.00"},{"v":0,"d":"0.00"},{"v":0,"d":"0.00"},{"v":0,"d":"0.00"},{"v":0,"d":"0.00"},{"v":0,"d":"0.00"},{"v":0,"d":"0.00"},{"v":0,"d":"0.00"},{"v":0,"d":"0.00"},{"v":0,"d":"0.00"},{"v":0,"d":"0.00"},{"v":0,"d":"0.00"},{"v":0,"d":"0.00"},{"v":0,"d":"0.00"},{"v":0,"d":"0.00"},{"v":0,"d":"0.00"},{"v":0,"d":"0.00"},{"v":0,"d":"0.00"},null,{"v":0,"d":"0.00"},false,"",null,0,0,{"$error":"#DIV/0!"},null,{"v":0,"d":"0.00"},{"v":0,"d":"0.00"},{"v":0,"d":"0.00"},{"v":0,"d":"0.00"},{"v":0,"d":"0.00"},{"v":0,"d":"0.00"},{"v":0,"d":"0.00"}]
[null,null,9,null,{"v":0,"d":"0.00"},{"v":0,"d":"0.00"},{"v":0,"d":"0.00"},{"v":0,"d":"0.00"},{"v":0,"d":"0.00"},{"v":0,"d":"0.00"},{"v":0,"d":"0.00"},{"v":0,"d":"0.00"},{"v":0,"d":"0.00"},{"v":0,"d":"0.00"},{"v":0,"d":"0.00"},{"v":0,"d":"0.00"},{"v":0,"d":"0.00"},{"v":0,"d":"0.00"},{"v":0,"d":"0.00"},{"v":0,"d":"0.00"},{"v":0,"d":"0.00"},{"$f":"_xlfn.IFNA(VLOOKUP(D20,Feedstuffs,43,FALSE),0)","v":{"v":0,"d":"0.00"}},{"v":0,"d":"0.00"},{"v":0,"d":"0.00"},{"v":0,"d":"0.00"},{"v":0,"d":"0.00"},null,{"v":0,"d":"0.00"},false,"",null,0,0,{"$error":"#DIV/0!"},null,{"v":0,"d":"0.00"},{"v":0,"d":"0.00"},{"v":0,"d":"0.00"},{"v":0,"d":"0.00"},{"v":0,"d":"0.00"},{"v":0,"d":"0.00"},{"v":0,"d":"0.00"}]
[null,null,10,null,{"v":0,"d":"0.00"},{"v":0,"d":"0.00"},{"$f":"_xlfn.IFNA(VLOOKUP(D21,Feedstuffs,29,FALSE),0)","v":{"v":0,"d":"0.00"}},{"$f":"_xlfn.IFNA(VLOOKUP(D21,Feedstuffs,31,FALSE),0)","v":{"v":0,"d":"0.00"}},{"$f":"_xlfn.IFNA(VLOOKUP(D21,Feedstuffs,33,FALSE),0)","v":{"v":0,"d":"0.00"}},{"$f":"_xlfn.IFNA(VLOOKUP(D21,Feedstuffs,35,FALSE),0)","v":{"v":0,"d":"0.00"}},{"$f":"_xlfn.IFNA(VLOOKUP(D21,Feedstuffs,5,FALSE),0)","v":{"v":0,"d":"0.00"}},{"$f":"_xlfn.IFNA(VLOOKUP(D21,Feedstuffs,6,),0)","v":{"v":0,"d":"0.00"}},{"$f":"_xlfn.IFNA(VLOOKUP(D21,Feedstuffs,7,FALSE),0)","v":{"v":0,"d":"0.00"}},{"$f":"_xlfn.IFNA(VLOOKUP(D21,Feedstuffs,9,FALSE),0)","v":{"v":0,"d":"0.00"}},{"$f":"_xlfn.IFNA(VLOOKUP(D21,Feedstuffs,10,FALSE),0)","v":{"v":0,"d":"0.00"}},{"$f":"_xlfn.IFNA(VLOOKUP(D21,Feedstuffs,11,FALSE),0)","v":{"v":0,"d":"0.00"}},{"$f":"_xlfn.IFNA(VLOOKUP(D21,Feedstuffs,12,FALSE),0)","v":{"v":0,"d":"0.00"}},{"$f":"_xlfn.IFNA(VLOOKUP(D21,Feedstuffs,13,FALSE),0)","v":{"v":0,"d":"0.00"}},{"$f":"_xlfn.IFNA(VLOOKUP(D21,Feedstuffs,39,FALSE),0)","v":{"v":0,"d":"0.00"}},{"$f":"_xlfn.IFNA(VLOOKUP(D21,Feedstuffs,40,FALSE),0)","v":{"v":0,"d":"0.00"}},{"$f":"_xlfn.IFNA(VLOOKUP(D21,Feedstuffs,41,FALSE),0)","v":{"v":0,"d":"0.00"}},{"$f":"_xlfn.IFNA(VLOOKUP(D21,Feedstuffs,43,FALSE),0)","v":{"v":0,"d":"0.00"}},{"$f":"_xlfn.IFNA(VLOOKUP(D21,Feedstuffs,44,FALSE),0)","v":{"v":0,"d":"0.00"}},{"$f":"_xlfn.IFNA(VLOOKUP(D21,Feedstuffs,20,FALSE),0)","v":{"v":0,"d":"0.00"}},{"$f":"_xlfn.IFNA(VLOOKUP(D21,Feedstuffs,21,FALSE),0)","v":{"v":0,"d":"0.00"}},{"$f":"_xlfn.IFNA(VLOOKUP(D21,Feedstuffs,22,FALSE),0)","v":{"v":0,"d":"0.00"}},null,{"v":0,"d":"0.00"},false,"",null,0,0,{"$error":"#DIV/0!"},null,{"$f":"_xlfn.IFNA(VLOOKUP(D21,Feedstuffs,15,FALSE),0)","v":{"v":0,"d":"0.00"}},{"$f":"_xlfn.IFNA(VLOOKUP(D21,Feedstuffs,16,FALSE),0)","v":{"v":0,"d":"0.00"}},{"$f":"_xlfn.IFNA(VLOOKUP(D21,Feedstuffs,17,FALSE),0)","v":{"v":0,"d":"0.00"}},{"$f":"_xlfn.IFNA(VLOOKUP(D21,Feedstuffs,18,FALSE),0)","v":{"v":0,"d":"0.00"}},{"$f":"_xlfn.IFNA(VLOOKUP(D21,Feedstuffs,19,FALSE),0)","v":{"v":0,"d":"0.00"}},{"$f":"_xlfn.IFNA(VLOOKUP(D21,Feedstuffs,24,FALSE),0)","v":{"v":0,"d":"0.00"}},{"$f":"_xlfn.IFNA(VLOOKUP(D21,Feedstuffs,25,FALSE),0)","v":{"v":0,"d":"0.00"}}]
[null,null,11,null,{"v":0,"d":"0.00"},{"v":0,"d":"0.00"},{"v":0,"d":"0.00"},{"v":0,"d":"0.00"},{"v":0,"d":"0.00"},{"v":0,"d":"0.00"},{"v":0,"d":"0.00"},{"v":0,"d":"0.00"},{"v":0,"d":"0.00"},{"v":0,"d":"0.00"},{"v":0,"d":"0.00"},{"v":0,"d":"0.00"},{"v":0,"d":"0.00"},{"v":0,"d":"0.00"},{"v":0,"d":"0.00"},{"v":0,"d":"0.00"},{"v":0,"d":"0.00"},{"v":0,"d":"0.00"},{"v":0,"d":"0.00"},{"v":0,"d":"0.00"},{"v":0,"d":"0.00"},{"v":0,"d":"0.00"},null,{"v":0,"d":"0.00"},false,"",null,0,0,{"$error":"#DIV/0!"},null,{"v":0,"d":"0.00"},{"v":0,"d":"0.00"},{"v":0,"d":"0.00"},{"v":0,"d":"0.00"},{"v":0,"d":"0.00"},{"v":0,"d":"0.00"},{"v":0,"d":"0.00"}]
[null,null,12,null,{"v":0,"d":"0.00"},{"v":0,"d":"0.00"},{"v":0,"d":"0.00"},{"v":0,"d":"0.00"},{"v":0,"d":"0.00"},{"v":0,"d":"0.00"},{"v":0,"d":"0.00"},{"v":0,"d":"0.00"},{"v":0,"d":"0.00"},{"v":0,"d":"0.00"},{"v":0,"d":"0.00"},{"v":0,"d":"0.00"},{"v":0,"d":"0.00"},{"v":0,"d":"0.00"},{"v":0,"d":"0.00"},{"v":0,"d":"0.00"},{"v":0,"d":"0.00"},{"v":0,"d":"0.00"},{"v":0,"d":"0.00"},{"v":0,"d":"0.00"},{"v":0,"d":"0.00"},{"v":0,"d":"0.00"},null,{"v":0,"d":"0.00"},false,"",null,0,0,{"$f":"F23*AF23/$AG$27","v":{"$error":"#DIV/0!"}},null,{"$f":"_xlfn.IFNA(VLOOKUP(D23,Feedstuffs,15,FALSE),0)","v":{"v":0,"d":"0.00"}},{"$f":"_xlfn.IFNA(VLOOKUP(D23,Feedstuffs,16,FALSE),0)","v":{"v":0,"d":"0.00"}},{"$f":"_xlfn.IFNA(VLOOKUP(D23,Feedstuffs,17,FALSE),0)","v":{"v":0,"d":"0.00"}},{"$f":"_xlfn.IFNA(VLOOKUP(D23,Feedstuffs,18,FALSE),0)","v":{"v":0,"d":"0.00"}},{"$f":"_xlfn.IFNA(VLOOKUP(D23,Feedstuffs,19,FALSE),0)","v":{"v":0,"d":"0.00"}},{"$f":"_xlfn.IFNA(VLOOKUP(D23,Feedstuffs,24,FALSE),0)","v":{"v":0,"d":"0.00"}},{"$f":"_xlfn.IFNA(VLOOKUP(D23,Feedstuffs,25,FALSE),0)","v":{"v":0,"d":"0.00"}}]
[]
[{"$nulls":3},"TOTAL",{"$f":"SUM(E12:E23)","v":{"v":0,"d":"0.00"}},{"$f":"SUM(F12:F23)","v":{"v":0,"d":"0.00"}},{"$f":"SUMPRODUCT($F$12:$F$23,G12:G23)/100","v":{"v":0,"d":"0.00"}},{"v":0,"d":"0.00"},{"$f":"SUMPRODUCT($F$12:$F$23,I12:I23)/100","v":{"v":0,"d":"0.00"}},{"v":0,"d":"0.00"},{"v":0,"d":"0.00"},{"v":0,"d":"0.00"},{"v":0,"d":"0.00"},{"$f":"SUMPRODUCT($F$12:$F$23,N12:N23)/10","v":{"v":0,"d":"0.00"}},{"v":0,"d":"0.00"},{"v":0,"d":"0.00"},{"$f":"SUMPRODUCT($F$12:$F$23,Q12:Q23)/10","v":{"v":0,"d":"0.00"}},{"v":0,"d":"0.00"},{"v":0,"d":"0.00"},{"v":0,"d":"0.00"},{"v":0,"d":"0.00"},{"v":0,"d":"0.00"},{"v":0,"d":"0.00"},{"v":0,"d":"0.00"},{"v":0,"d":"0.00"},{"$f":"SUMPRODUCT($F$12:$F$23,Z12:Z23)/10","v":{"v":0,"d":"0.00"}},{"$nulls":6},{"$f":"SUM(AG12:AG23)","v":0},null,null,{"$f":"SUMPRODUCT($F$12:$F$23,AJ12:AJ23)/100","v":{"v":0,"d":"0.00"}},{"v":0,"d":"0.00"},{"v":0,"d":"0.00"},{"v":0,"d":"0.00"},{"v":0,"d":"0.00"},{"v":0,"d":"0.00"},{"v":0,"d":"0.00"}]
[{"$nulls":3},"Grinder capacity?",{"$f":"E9-E25","v":{"v":500,"d":"500.00"}},"kg"]
[{"$nulls":6},"ME growing pigs","NE growng pigs","ME adult pigs","NE adult pigs","CP % max","Fiber Obj","FAT Obj","LYS Min ","THR Min ","MET Min","MET+CYS Min ","TRY  Min","DIS Lys","DIS THR","DIS MET","DIS MET + CYS","DIS TRY","Ca Obj","P Obj","Na Obj ",{"$nulls":5},"Feed Price (€/T)",{"$f":"SUMPRODUCT(F12:F23,AF12:AF23)/100","v":0}]
[{"$nulls":5},"Min",{"$f":"_xlfn.IFNA(VLOOKUP($Q$10,Requirement,43,FALSE),)","v":{"v":0,"d":"0.00"}},{"$f":"_xlfn.IFNA(VLOOKUP($Q$10,Requirement,45,FALSE),)","v":{"v":0,"d":"0.00"}},{"$f":"_xlfn.IFNA(VLOOKUP($Q$10,Requirement,6,FALSE),)","v":{"v":0,"d":"0.00"}},{"$f":"_xlfn.IFNA(VLOOKUP($Q$10,Requirement,8,FALSE),)","v":{"v":0,"d":"0.00"}},{"$f":"_xlfn.IFNA(VLOOKUP($Q$10,Requirement,10,FALSE),)","v":{"v":0,"d":"0.00"}},{"$f":"_xlfn.IFNA(VLOOKUP($Q$10,Requirement,12,FALSE),)","v":{"v":0,"d":"0.00"}},{"$f":"_xlfn.IFNA(VLOOKUP($Q$10,Requirement,14,FALSE),)","v":{"v":0,"d":"0.00"}},{"$f":"_xlfn.IFNA(VLOOKUP($Q$10,Requirement,23,FALSE),)","v":{"v":0,"d":"0.00"}},{"$f":"_xlfn.IFNA(VLOOKUP($Q$10,Requirement,39,FALSE),)","v":{"v":0,"d":"0.00"}},{"$f":"_xlfn.IFNA(VLOOKUP($Q$10,Requirement,27,FALSE),)","v":{"v":0,"d":"0.00"}},{"$f":"_xlfn.IFNA(VLOOKUP($Q$10,Requirement,35,FALSE),)","v":{"v":0,"d":"0.00"}},{"$f":"_xlfn.IFNA(VLOOKUP($Q$10,Requirement,31,FALSE),)","v":{"v":0,"d":"0.00"}},{"$f":"_xlfn.IFNA(VLOOKUP($Q$10,Requirement,25,FALSE),)","v":{"v":0,"d":"0.00"}},{"$f":"_xlfn.IFNA(VLOOKUP($Q$10,Requirement,41,FALSE),)","v":{"v":0,"d":"0.00"}},{"$f":"_xlfn.IFNA(VLOOKUP($Q$10,Requirement,29,FALSE),)","v":{"v":0,"d":"0.00"}},{"$f":"_xlfn.IFNA(VLOOKUP($Q$10,Requirement,37,FALSE),)","v":{"v":0,"d":"0.00"}},{"$f":"_xlfn.IFNA(VLOOKUP($Q$10,Requirement,33,FALSE),)","v":{"v":0,"d":"0.00"}},{"$f":"_xlfn.IFNA(VLOOKUP($Q$10,Requirement,16,FALSE),)","v":{"v":0,"d":"0.00"}},{"$f":"_xlfn.IFNA(VLOOKUP($Q$10,Requirement,18,FALSE),)","v":{"v":0,"d":"0.00"}},{"$f":"_xlfn.IFNA(VLOOKUP($Q$10,Requirement,21,FALSE),)","v":{"v":0,"d":"0.00"}}]
[{"$nulls":5},"Max",{"$f":"_xlfn.IFNA(VLOOKUP($Q$10,Requirement,44,FALSE),)","v":{"v":0,"d":"0.00"}},{"$f":"_xlfn.IFNA(VLOOKUP($Q$10,Requirement,46,FALSE),)","v":{"v":0,"d":"0.00"}},{"$f":"_xlfn.IFNA(VLOOKUP($Q$10,Requirement,7,FALSE),)","v":{"v":0,"d":"0.00"}},{"$f":"_xlfn.IFNA(VLOOKUP($Q$10,Requirement,9,FALSE),)","v":{"v":0,"d":"0.00"}},{"$f":"_xlfn.IFNA(VLOOKUP($Q$10,Requirement,11,FALSE),)","v":{"v":0,"d":"0.00"}},{"$f":"_xlfn.IFNA(VLOOKUP($Q$10,Requirement,13,FALSE),)","v":{"v":0,"d":"0.00"}},{"$f":"_xlfn.IFNA(VLOOKUP($Q$10,Requirement,15,FALSE),)","v":{"v":0,"d":"0.00"}},{"$f":"_xlfn.IFNA(VLOOKUP($Q$10,Requirement,24,FALSE),)","v":{"v":0,"d":"0.00"}},{"$f":"_xlfn.IFNA(VLOOKUP($Q$10,Requirement,40,FALSE),)","v":{"v":0,"d":"0.00"}},{"$f":"_xlfn.IFNA(VLOOKUP($Q$10,Requirement,28,FALSE),)","v":{"v":0,"d":"0.00"}},{"$f":"_xlfn.IFNA(VLOOKUP($Q$10,Requirement,36,FALSE),)","v":{"v":0,"d":"0.00"}},{"$f":"_xlfn.IFNA(VLOOKUP($Q$10,Requirement,32,FALSE),)","v":{"v":0,"d":"0.00"}},{"$f":"_xlfn.IFNA(VLOOKUP($Q$10,Requirement,26,FALSE),)","v":{"v":0,"d":"0.00"}},{"$f":"_xlfn.IFNA(VLOOKUP($Q$10,Requirement,42,FALSE),)","v":{"v":0,"d":"0.00"}},{"$f":"_xlfn.IFNA(VLOOKUP($Q$10,Requirement,30,FALSE),)","v":{"v":0,"d":"0.00"}},{"$f":"_xlfn.IFNA(VLOOKUP($Q$10,Requirement,38,FALSE),)","v":{"v":0,"d":"0.00"}},{"$f":"_xlfn.IFNA(VLOOKUP($Q$10,Requirement,34,FALSE),)","v":{"v":0,"d":"0.00"}},{"$f":"_xlfn.IFNA(VLOOKUP($Q$10,Requirement,17,FALSE),)","v":{"v":0,"d":"0.00"}},{"$f":"_xlfn.IFNA(VLOOKUP($Q$10,Requirement,19,FALSE),)","v":{"v":0,"d":"0.00"}},{"$f":"_xlfn.IFNA(VLOOKUP($Q$10,Requirement,22,FALSE),)","v":{"v":0,"d":"0.00"}}]
[]
[]
[{"$nulls":6},"List selections"]
[{"$nulls":6},"Manual selections"]

{"sheet":"Database_Feedstuffs","index":2,"n_rows":81,"n_cols":45,"rows_kept":81,"merged":[[0,0,0,2],[0,3,0,7],[0,8,0,13],[0,14,0,18],[0,19,0,24],[0,25,0,35],[0,36,0,37],[0,38,0,43]]}
[{"$nulls":3},"Main Constituents ",{"$nulls":4},"Total Amino Acid",{"$nulls":5},"Total Fatty acid",{"$nulls":4},"Total Minerals ",{"$nulls":5},"Total Energy of Pigs",{"$nulls":10},"Inclusion levels in the Pigs diet",null,"Amino Acid Digestibility"]
["Feedstuffs","Matière première","Class","DM % ","CP % ","Fiber %","FAT % ","Ash % ","LYS % ","THR % ","MET % ","MET+CYS % ","TRY % ","CYS % ","C16:0 % Fat","C18:0 % Fat","C18:1 % Fat (Oleic)","C18:2 % Fat (linoleic)","C18:3 % Fat (Alpha linolenic)","Ca % ","P % ","Na % ","Phytate P g/kg ","Mg % ","K % as fed","DE growing pig  Mj/kg ","DE Pig adult Mj/kg ","Dig. P pig (without phytase) g/kg ","ME growing pig Mj/kg ","ME growing pig (Kcal/Kg)","NE growing pig Mj/kg ","NE growing pig Kcal/kg ","ME pig adult Mj/kg ","ME pig adult Kcal/Kg","NE pig adult  Mj/kg ","NE pig adult Kcal/Kg","Piglet\n% max","Pigs and sows\n% max","DIS LYS pig % ","DIS THR pig % ","DIS MET pig % ","DIS CYS pig % ","DIS MET+CYS pig % ","DIS TRY pig % ","Source "]
["Alfalfa protein concentrate",null,"Other",{"v":92,"d":"92.0"},{"v":49.20000076293945,"d":"49.2"},{"v":2.9000000953674316,"d":"2.9"},{"v":8.199999809265137,"d":"8.2"},{"v":10.100000381469727,"d":"10.1"},{"v":2.9399999618530273,"d":"2.94"},{"v":2.339999961853027,"d":"2.34"},{"v":1,"d":"1.00"},{"v":1.4699999809265136,"d":"1.47"},0.75,{"v":0.4699999809265137,"d":"0.47"},{"v":16.600000381469727,"d":"16.6"},{"v":2.799999952316284,"d":"2.8"},{"v":7.599999904632568,"d":"7.6"},{"v":29.299999237060547,"d":"29.3"},{"v":35.79999923706055,"d":"35.8"},{"v":3.3700000762939455,"d":"3.37"},{"v":0.8399999618530274,"d":"0.84"},{"v":7.000000000000001E-3,"d":"0.01"},{"v":0.4000000059604645,"d":"0.4"},{"v":0.13999999761581422,"d":"0.14"},{"v":0.7,"d":"0.70"},{"v":15.230125523012552,"d":"15.23"},{"v":15.774058577405858,"d":"15.77"},{"v":0,"d":"0.00"},{"v":13.93305439330544,"d":"13.93"},3330,{"v":8.99581589958159,"d":"9.00"},2150,{"v":14.309623430962343,"d":"14.31"},3420,{"v":9.330543933054393,"d":"9.33"},2230,10,10,{"v":0,"d":"0.00"},{"v":0,"d":"0.00"},{"v":0,"d":"0.00"},{"v":0,"d":"0.00"},{"v":0,"d":"0.00"},{"v":0,"d":"0.00"}]
["Alfalfa, dehydrated, protein < 16% ",null,"Dehydrated forage ",{"v":92.5999984741211,"d":"92.6"},{"v":13.600000381469727,"d":"13.6"},{"v":28.899999618530273,"d":"28.9"},{"v":2.200000047683716,"d":"2.2"},9.5,{"v":0.5199999809265137,"d":"0.52"},{"v":0.45999999046325685,"d":"0.46"},{"v":0.1100000023841858,"d":"0.11"},{"v":0.3,"d":"0.30"},{"v":0.1899999976158142,"d":"0.19"},{"v":0.1899999976158142,"d":"0.19"},{"v":16.600000381469727,"d":"16.6"},{"v":2.799999952316284,"d":"2.8"},{"v":7.599999904632568,"d":"7.6"},{"v":29.299999237060547,"d":"29.3"},{"v":35.79999923706055,"d":"35.8"},{"v":1.7700000762939454,"d":"1.77"},{"v":0.24000000953674316,"d":"0.24"},{"v":0.05600000023841858,"d":"0.06"},{"v":0.10000000149011612,"d":"0.1"},{"v":0.1899999976158142,"d":"0.19"},{"v":2.3,"d":"2.30"},{"v":7.2803347280334725,"d":"7.28"},{"v":7.949790794979079,"d":"7.95"},{"v":0.699999988079071,"d":"0.70"},{"v":6.820083682008368,"d":"6.82"},1630,{"v":3.723849372384937,"d":"3.72"},890,{"v":7.196652719665272,"d":"7.20"},1720,{"v":4.01673640167364,"d":"4.02"},960,{"v":0,"d":"0.00"},10,0.2700000047683716,0.27999999523162844,0.0800000011920929,0.06000000238418579,0.13999999761581422,0.0899999976158142,"Organic table  (ITAB &AFZ)"]
["Alfalfa, dehydrated, protein 16-18% ",null,"Dehydrated forage ",{"v":91.9000015258789,"d":"91.9"},{"v":15.600000381469727,"d":"15.6"},26.5,{"v":2.200000047683716,"d":"2.2"},{"v":9.800000190734863,"d":"9.8"},{"v":0.6599999904632569,"d":"0.66"},{"v":0.5699999809265137,"d":"0.57"},{"v":0.1600000023841858,"d":"0.16"},{"v":0.3599999904632568,"d":"0.36"},{"v":0.2200000047683716,"d":"0.22"},{"v":0.2,"d":"0.20"},{"v":16.600000381469727,"d":"16.6"},{"v":2.799999952316284,"d":"2.8"},{"v":7.599999904632568,"d":"7.6"},{"v":29.299999237060547,"d":"29.3"},{"v":35.79999923706055,"d":"35.8"},2.05,{"v":0.22999999523162842,"d":"0.23"},{"v":0.033000001311302186,"d":"0.03"},{"v":0.10000000149011612,"d":"0.1"},{"v":0.1799999952316284,"d":"0.18"},{"v":2.3799999237060545,"d":"2.38"},{"v":7.573221757322176,"d":"7.57"},{"v":8.200836820083682,"d":"8.20"},{"v":1,"d":"1.00"},{"v":7.071129707112971,"d":"7.07"},1690,{"v":3.933054393305439,"d":"3.93"},940,{"v":7.447698744769874,"d":"7.45"},1780,{"v":4.2259414225941425,"d":"4.23"},1010.0000000000001,{"v":0,"d":"0.00"},10,0.3700000047683716,0.3599999904632568,0.12000000476837158,0.06999999880790711,0.1899999976158142,0.1,"Organic table  (ITAB &AFZ)"]
["Alfalfa, dehydrated, protein 17-19% ",null,"Dehydrated forage ",{"v":92.0999984741211,"d":"92.1"},{"v":16.399999618530273,"d":"16.4"},{"v":25.399999618530273,"d":"25.4"},{"v":2.299999952316284,"d":"2.3"},{"v":10,"d":"10.0"},{"v":0.7199999809265136,"d":"0.72"},{"v":0.6099999904632568,"d":"0.61"},{"v":0.1799999952316284,"d":"0.18"},{"v":0.3900000095367432,"d":"0.39"},{"v":0.22999999523162842,"d":"0.23"},{"v":0.20999999046325685,"d":"0.21"},{"v":16.600000381469727,"d":"16.6"},{"v":2.799999952316284,"d":"2.8"},{"v":7.599999904632568,"d":"7.6"},{"v":29.299999237060547,"d":"29.3"},{"v":35.79999923706055,"d":"35.8"},{"v":1.8799999237060547,"d":"1.88"},{"v":0.24000000953674316,"d":"0.24"},{"v":0.03899999856948853,"d":"0.04"},{"v":0.10000000149011612,"d":"0.1"},{"v":0.1899999976158142,"d":"0.19"},{"v":2.220000076293945,"d":"2.22"},{"v":7.7405857740585775,"d":"7.74"},{"v":8.368200836820083,"d":"8.37"},{"v":0.8999999761581421,"d":"0.90"},{"v":7.196652719665272,"d":"7.20"},1720,{"v":4.058577405857741,"d":"4.06"},970.0000000000001,{"v":7.573221757322176,"d":"7.57"},1810,{"v":4.351464435146443,"d":"4.35"},1040,{"v":0,"d":"0.00"},10,0.40999999046325686,0.3900000095367432,0.13999999761581422,0.06999999880790711,0.20999999046325685,0.1100000023841858,"Organic table  (ITAB &AFZ)"]
["Alfalfa, dehydrated, protein 19-22% ",null,"Dehydrated forage ",{"v":92,"d":"92.0"},{"v":18.600000381469727,"d":"18.6"},{"v":23.600000381469727,"d":"23.6"},{"v":2.799999952316284,"d":"2.8"},{"v":10.600000381469727,"d":"10.6"},{"v":0.8600000381469727,"d":"0.86"},{"v":0.7199999809265136,"d":"0.72"},{"v":0.22999999523162842,"d":"0.23"},{"v":0.45999999046325685,"d":"0.46"},{"v":0.25999999046325684,"d":"0.26"},{"v":0.22999999523162842,"d":"0.23"},{"v":16.600000381469727,"d":"16.6"},{"v":2.799999952316284,"d":"2.8"},{"v":7.599999904632568,"d":"7.6"},{"v":29.299999237060547,"d":"29.3"},{"v":35.79999923706055,"d":"35.8"},{"v":2,"d":"2.00"},{"v":0.24000000953674316,"d":"0.24"},{"v":0.04000000059604645,"d":"0.04"},{"v":0.10000000149011612,"d":"0.1"},{"v":0.1899999976158142,"d":"0.19"},{"v":2.3,"d":"2.30"},{"v":8.03347280334728,"d":"8.03"},{"v":8.619246861924687,"d":"8.62"},{"v":0.800000011920929,"d":"0.80"},{"v":7.489539748953975,"d":"7.49"},1790,{"v":4.2677824267782425,"d":"4.27"},1020,{"v":0,"d":"0.00"},0,{"v":4.560669456066946,"d":"4.56"},1090,{"v":0,"d":"0.00"},10,0.5300000190734864,0.4699999809265137,0.1799999952316284,0.0800000011920929,0.25999999046325684,0.12000000476837158,"Organic table  (ITAB &AFZ)"]
["Apple Pulp (Dried)",null,"Other plant product ",{"v":91,"d":"91.0"},7.3,26.4,{"v":3,"d":"3.0"},2.1,0.31,0.23,0.11,0.18,0.08,0.07,3.5,0.3,1.2,14.4,1.9,0.09,0.12,0.26,{"v":0.07,"d":"0.1"},{"v":0.006,"d":"0.01"},{"v":0.3,"d":"0.30"},{"v":8.9,"d":"8.90"},{"v":10.1,"d":"10.10"},{"v":0,"d":"0.00"},{"v":8.5,"d":"8.50"},2020,{"v":5.2,"d":"5.20"},1250,{"v":9.3,"d":"9.30"},2230,{"v":5.9,"d":"5.90"},1410,{"v":0,"d":"0.00"},{"v":0,"d":"0.00"},0.18,0.14,0.08,0.04,0.13,0.05,"Feedtable (INRA)"]
["Barley 10,3% CP","Orge 10,3% MAT","Cereals",87.9,10.3,4.7,1.8,2.2,{"v":0.4,"d":"0.40"},0.37,0.18,{"v":0.42000000000000004,"d":"0.42"},0.13,0.24,21.2,1.1,13.4,55.9,8.7,{"v":0.06999999999999999,"d":"0.07"},{"v":0.33999999999999997,"d":"0.34"},{"v":0.003,"d":"0.00"},1.8,{"v":0.11000000000000001,"d":"0.11"},{"v":0.49000000000000005,"d":"0.49"},{"v":13.01255230125523,"d":"13.01"},{"v":13.389121338912133,"d":"13.39"},1.1,{"v":12.594142259414227,"d":"12.59"},3010,{"v":9.707112970711297,"d":"9.71"},2320,{"v":12.845188284518828,"d":"12.85"},3070,{"v":9.916317991631798,"d":"9.92"},2370,40,50,{"v":0.27999999999999997,"d":"0.28"},0.25,{"v":0.13999999999999999,"d":"0.14"},0.19,{"v":0.32999999999999996,"d":"0.33"},{"v":0.1,"d":"0.10"},"Organic table  (ITAB &AFZ)"]
["Barley 8,3% CP","Orge 8,3% MAT","Cereals",87.9,8.3,4.7,1.8,2.2,0.32,0.29,{"v":0.13999999999999999,"d":"0.14"},{"v":0.33999999999999997,"d":"0.34"},{"v":0.11000000000000001,"d":"0.11"},{"v":0.2,"d":"0.20"},21.2,1.1,13.4,55.9,8.7,{"v":0.06999999999999999,"d":"0.07"},{"v":0.33999999999999997,"d":"0.34"},{"v":0.003,"d":"0.00"},1.8,{"v":0.11000000000000001,"d":"0.11"},{"v":0.49000000000000005,"d":"0.49"},{"v":12.92887029288703,"d":"12.93"},{"v":13.263598326359833,"d":"13.26"},1.1,{"v":12.552301255230125,"d":"12.55"},3000,{"v":9.665271966527197,"d":"9.67"},2310,{"v":12.803347280334728,"d":"12.80"},3060,{"v":9.874476987447698,"d":"9.87"},2360,40,50,{"v":0.27999999999999997,"d":"0.28"},0.25,{"v":0.13999999999999999,"d":"0.14"},0.19,{"v":0.32999999999999996,"d":"0.33"},{"v":0.1,"d":"0.10"},"Organic table  (ITAB &AFZ)"]
["Barley 9,3% CP","Orge 9,3% MAT","Cereals",87.9,9.3,4.7,1.8,2.2,0.36,{"v":0.32999999999999996,"d":"0.33"},0.16,0.38,0.12,{"v":0.22000000000000003,"d":"0.22"},21.2,1.1,13.4,55.9,8.7,{"v":0.06999999999999999,"d":"0.07"},{"v":0.33999999999999997,"d":"0.34"},{"v":0.003,"d":"0.00"},1.8,{"v":0.11000000000000001,"d":"0.11"},{"v":0.49000000000000005,"d":"0.49"},{"v":12.92887029288703,"d":"12.93"},{"v":13.263598326359833,"d":"13.26"},1.1,{"v":12.510460251046025,"d":"12.51"},2990,{"v":9.623430962343097,"d":"9.62"},2300,{"v":12.761506276150628,"d":"12.76"},3050,{"v":9.832635983263598,"d":"9.83"},2350,40,50,{"v":0.27999999999999997,"d":"0.28"},0.25,{"v":0.13999999999999999,"d":"0.14"},0.19,{"v":0.32999999999999996,"d":"0.33"},{"v":0.1,"d":"0.10"},"Organic table  (ITAB &AFZ)"]
["Beetroot pulp (dried)",null,"Other plant product ",88.8,7.9,17.2,0.8,6.3,{"v":0.45999999999999996,"d":"0.46"},0.36,0.13,{"v":0.22000000000000003,"d":"0.22"},0.08,0.09,20.6,1.4,9.7,57.8,10.5,1.29,0.09,{"v":0.053000000000000005,"d":"0.05"},{"v":0.09,"d":"0.1"},0.16,{"v":0.4,"d":"0.40"},{"v":10.794979079497908,"d":"10.79"},{"v":12.259414225941423,"d":"12.26"},{"v":0,"d":"0.00"},{"v":10.167364016736402,"d":"10.17"},2430,{"v":6.150627615062762,"d":"6.15"},1470,{"v":11.00418410041841,"d":"11.00"},2630,{"v":7.112970711297071,"d":"7.11"},1700,5,20,{"v":0.22999999999999998,"d":"0.23"},{"v":0.11000000000000001,"d":"0.11"},0.08,0.02,{"v":0.1,"d":"0.10"},0.03,"INRA feed table 902"]
["Bicalcium Phosphate",null,"Minerals",{"v":97,"d":"97.0"},{"v":0,"d":"0.00"},{"v":0,"d":"0.00"},{"v":0,"d":"0.00"},88.5,{"v":0,"d":"0.00"},{"v":0,"d":"0.00"},{"v":0,"d":"0.00"},{"v":0,"d":"0.00"},{"v":0,"d":"0.00"},{"v":0,"d":"0.00"},{"v":0,"d":"0.0"},{"v":0,"d":"0.0"},{"v":0,"d":"0.0"},{"v":0,"d":"0.0"},{"v":0,"d":"0.0"},{"v":27.2,"d":"27.20"},{"v":20.4,"d":"20.40"},0.25,{"v":0,"d":"0.00"},0.59,0.22,{"v":0,"d":"0.00"},{"v":0,"d":"0.00"},{"v":0,"d":"0.00"},{"v":0,"d":"0.00"},{"v":0,"d":"0.00"},{"v":0,"d":"0.00"},{"v":0,"d":"0.00"},{"v":0,"d":"0.00"},{"v":0,"d":"0.00"},{"v":0,"d":"0.00"},{"v":0,"d":"0.00"},5,5,{"v":0,"d":"0.00"},{"v":0,"d":"0.00"},{"v":0,"d":"0.00"},{"v":0,"d":"0.00"},{"v":0,"d":"0.00"},{"v":0,"d":"0.00"},"INRA table"]
["Blue Lupine",null,"Legume seeds",90.3,30.3,14.2,5.4,3.2,1.53,{"v":1.1800000000000002,"d":"1.18"},0.26,{"v":0.8,"d":"0.80"},{"v":0.22000000000000003,"d":"0.22"},0.54,6.9,3.6,31.9,46.7,4.8,0.26,{"v":0.33999999999999997,"d":"0.34"},{"v":0.004,"d":"0.00"},2.1,0.19,0.99,{"v":14.309623430962343,"d":"14.31"},{"v":15.732217573221757,"d":"15.73"},1.7,{"v":13.305439330543933,"d":"13.31"},3180,{"v":8.451882845188285,"d":"8.45"},2020.0000000000002,{"v":14.351464435146443,"d":"14.35"},3430,{"v":9.330543933054393,"d":"9.33"},2230,5,10,1.33,{"v":0.9800000000000001,"d":"0.98"},{"v":0.22999999999999998,"d":"0.23"},{"v":0.47000000000000003,"d":"0.47"},{"v":0.6900000000000001,"d":"0.69"},1.24,"INRA feed table 2002"]
["Brewery draft dried",null,"Wheat by-products",{"v":91,"d":"91.0"},25.8,15.8,6.7,4.6,0.31,0.32,0.15,{"v":0.32999999999999996,"d":"0.33"},0.12,0.18,{"v":0,"d":"0.00"},{"v":0,"d":"0.00"},{"v":0,"d":"0.00"},{"v":0,"d":"0.00"},{"v":0,"d":"0.00"},0.27,{"v":0.5700000000000001,"d":"0.57"},{"v":0,"d":"0.00"},{"v":0,"d":"0.00"},0.26,{"v":0.45999999999999996,"d":"0.46"},{"v":14.100418410041842,"d":"14.10"},{"v":0,"d":"0.00"},{"v":0,"d":"0.00"},{"v":14.07531380753138,"d":"14.08"},3364,{"v":0,"d":"0.00"},{"v":0,"d":"0.00"},{"v":0,"d":"0.00"},{"v":0,"d":"0.00"},{"v":0,"d":"0.00"},{"v":0,"d":"0.00"},{"v":0,"d":"0.00"},20,{"v":0,"d":"0.00"},{"v":0,"d":"0.00"},{"v":0,"d":"0.00"},{"v":0,"d":"0.00"},{"v":0,"d":"0.00"},{"v":0,"d":"0.00"},"Albuquerque et al., R. Bras. Zootec., v.41, n.7, p.1784-1788, 2012"]
["Buckwheat","Sarrasin","Cereals",84.9,13.2,13.1,2.6,2.9,{"v":0.5700000000000001,"d":"0.57"},0.36,{"v":0.22999999999999998,"d":"0.23"},0.41,0.06,0.18,16.6,1.6,35.8,36.8,4.1,{"v":0.22000000000000003,"d":"0.22"},{"v":0.32999999999999996,"d":"0.33"},{"v":0,"d":"0.00"},{"v":0,"d":"0.00"},{"v":0.012,"d":"0.01"},{"v":0,"d":"0.00"},{"v":12.301255230125523,"d":"12.30"},{"v":0,"d":"0.00"},{"v":0,"d":"0.00"},{"v":11.882845188284518,"d":"11.88"},2840,{"v":9.205020920502092,"d":"9.21"},2200,{"v":0,"d":"0.00"},{"v":0,"d":"0.00"},{"v":0,"d":"0.00"},{"v":0,"d":"0.00"},{"v":0,"d":"0.00"},40,{"v":0,"d":"0.00"},{"v":0,"d":"0.00"},{"v":0,"d":"0.00"},{"v":0,"d":"0.00"},{"v":0,"d":"0.00"},{"v":0,"d":"0.00"},"Feedipedia"]
["Calcium carbonate",null,"Minerals",99.9,{"v":0,"d":"0.0"},{"v":0,"d":"0.0"},{"v":0,"d":"0.0"},99.3,{"v":0,"d":"0.00"},{"v":0,"d":"0.00"},{"v":0,"d":"0.00"},{"v":0,"d":"0.00"},{"v":0,"d":"0.00"},{"v":0,"d":"0.00"},{"v":0,"d":"0.0"},{"v":0,"d":"0.0"},{"v":0,"d":"0.0"},{"v":0,"d":"0.0"},{"v":0,"d":"0.0"},{"v":38.7,"d":"38.70"},0.03,{"v":0.064,"d":"0.06"},{"v":0,"d":"0.00"},0.04,{"v":0,"d":"0.00"},{"v":0,"d":"0.00"},{"v":0,"d":"0.00"},{"v":0,"d":"0.00"},{"v":0,"d":"0.00"},0,{"v":0,"d":"0.00"},{"v":0,"d":"0.00"},{"v":0,"d":"0.00"},{"v":0,"d":"0.00"},{"v":0,"d":"0.00"},{"v":0,"d":"0.00"},5,5,{"v":0,"d":"0.00"},{"v":0,"d":"0.00"},{"v":0,"d":"0.00"},{"v":0,"d":"0.00"},{"v":0,"d":"0.00"},{"v":0,"d":"0.00"},"Organic table  (ITAB &AFZ)"]
["Camelina cake",null,"Oilseeds (Cake)",91.1,33.2,11.5,14.5,5.5,1.54,{"v":1.3,"d":"1.30"},0.64,{"v":1.3900000000000001,"d":"1.39"},0.38,0.76,8.1,2.5,18.3,24.6,33.2,{"v":0.33999999999999997,"d":"0.34"},0.86,{"v":0.005,"d":"0.01"},5.2,0.36,{"v":1.2,"d":"1.20"},{"v":11.338912133891213,"d":"11.34"},{"v":12.594142259414227,"d":"12.59"},2.8,{"v":10.460251046025105,"d":"10.46"},2500,{"v":7.866108786610878,"d":"7.87"},1880,{"v":11.589958158995817,"d":"11.59"},2770,{"v":8.410041841004183,"d":"8.41"},2009.9999999999998,5,5,0.82,0.6599999999999999,0.47000000000000003,0.41,0.8800000000000001,0.31,"Organic table  (ITAB &AFZ)"]
["Chickpea (Extruded)",null,"Legume seeds",87.9,18.6,3.4,5.5,2.9,1.26,{"v":0.6599999999999999,"d":"0.66"},{"v":0.22999999999999998,"d":"0.23"},0.45,{"v":0.16999999999999998,"d":"0.17"},{"v":0.22000000000000003,"d":"0.22"},25.5,1.8,53.3,13.1,5.5,0.12,0.41,{"v":0.034,"d":"0.03"},{"v":2,"d":"2.0"},0.13,0.96,{"v":14.769874476987448,"d":"14.77"},{"v":15.355648535564853,"d":"15.36"},{"v":0,"d":"0.00"},{"v":14.184100418410042,"d":"14.18"},3390,{"v":10.669456066945607,"d":"10.67"},2550,{"v":14.644351464435147,"d":"14.64"},3500,{"v":11.00418410041841,"d":"11.00"},2630,10,25,{"v":0,"d":"0.00"},{"v":0,"d":"0.00"},{"v":0,"d":"0.00"},{"v":0,"d":"0.00"},{"v":0,"d":"0.00"},{"v":0,"d":"0.00"},"INRA feed table 2002"]
["Conventionnal corn gluten",null,"Cereals byproducts",87.8,18.9,7.9,2.5,5.7,{"v":0.6,"d":"0.60"},0.65,0.32,0.67,0.13,0.35,10.5,1.8,26.1,59.5,1.3,{"v":0.13999999999999999,"d":"0.14"},0.86,{"v":0.08299999999999999,"d":"0.08"},5.6,0.37,1.35,{"v":10.460251046025105,"d":"10.46"},{"v":12.343096234309623,"d":"12.34"},1.9,{"v":9.832635983263598,"d":"9.83"},2350,{"v":6.569037656903766,"d":"6.57"},1570,{"v":11.422594142259415,"d":"11.42"},2730,{"v":7.7405857740585775,"d":"7.74"},1850,5,5,{"v":0.4,"d":"0.40"},{"v":0.45999999999999996,"d":"0.46"},{"v":0.21000000000000002,"d":"0.21"},0.24,0.51,0.08,"INRA feed table 2602"]
["Conventionnal potato protein",null,"Root byproduct",91.8,77.2,0.8,0.6,2.4,5.89,4.34,{"v":1.7,"d":"1.70"},2.75,1.08,1.05,17.8,5.4,1.9,56.5,17.2,{"v":0.2,"d":"0.20"},0.41,{"v":0.041999999999999996,"d":"0.04"},0.6,0.05,0.54,{"v":19.8744769874477,"d":"19.87"},{"v":20,"d":"20.00"},{"v":0,"d":"0.00"},{"v":17.824267782426777,"d":"17.82"},4260,{"v":10.334728033472803,"d":"10.33"},2470,{"v":17.86610878661088,"d":"17.87"},4270,{"v":10.585774058577407,"d":"10.59"},2530,5,5,{"v":0.527,"d":"0.53"},{"v":0.388,"d":"0.39"},{"v":0.155,"d":"0.16"},{"v":0.08199999999999999,"d":"0.08"},{"v":0.23700000000000002,"d":"0.24"},{"v":0.08099999999999999,"d":"0.08"},"INRA feed table 102"]
["Corn 7,6% CP","Maïs 7,6% MAT","Cereals",86.4,7.6,2.3,3.3,1.2,{"v":0.22999999999999998,"d":"0.23"},0.29,0.16,0.35,0.05,0.19,3.2,0.5,7.9,17.9,0.4,0.04,0.26,0.01,1.9,{"v":0.11000000000000001,"d":"0.11"},0.31,{"v":14.01673640167364,"d":"14.02"},{"v":14.602510460251047,"d":"14.60"},0.7,{"v":13.682008368200837,"d":"13.68"},3270,{"v":10.96234309623431,"d":"10.96"},2620,{"v":14.184100418410042,"d":"14.18"},3390,{"v":11.297071129707113,"d":"11.30"},2700,50,50,0.19,0.24,0.15,{"v":0.16999999999999998,"d":"0.17"},0.32,0.04,"Organic table  (ITAB &AFZ)"]
["Corn 8,6% CP","Maïs 8,6% MAT","Cereals",86.4,7.6,2.3,3.3,1.2,0.26,{"v":0.32999999999999996,"d":"0.33"},0.18,{"v":0.4,"d":"0.40"},0.06,{"v":0.22000000000000003,"d":"0.22"},3.2,0.5,7.9,17.9,0.4,0.04,0.26,0.01,1.9,{"v":0.11000000000000001,"d":"0.11"},0.31,{"v":14.225941422594142,"d":"14.23"},{"v":14.769874476987448,"d":"14.77"},0.7,{"v":13.849372384937238,"d":"13.85"},3310,{"v":11.04602510460251,"d":"11.05"},2640,{"v":14.309623430962343,"d":"14.31"},3420,{"v":11.297071129707113,"d":"11.30"},2700,50,50,0.19,0.24,0.15,{"v":0.16999999999999998,"d":"0.17"},0.32,0.04,"Organic table  (ITAB &AFZ)"]
["Corn 9,6% CP","Maïs 9,6% MAT","Cereals",86.4,7.6,2.3,3.3,1.2,0.29,0.37,{"v":0.2,"d":"0.20"},{"v":0.44000000000000006,"d":"0.44"},0.06,0.24,3.2,0.5,7.9,17.9,0.4,0.04,0.26,0.01,1.9,{"v":0.11000000000000001,"d":"0.11"},0.31,{"v":14.267782426778243,"d":"14.27"},{"v":14.811715481171548,"d":"14.81"},0.7,{"v":13.891213389121338,"d":"13.89"},3320,{"v":11.171548117154812,"d":"11.17"},2670,{"v":14.351464435146443,"d":"14.35"},3430,{"v":11.297071129707113,"d":"11.30"},2700,50,50,0.19,0.24,0.15,{"v":0.16999999999999998,"d":"0.17"},0.32,0.04,"Organic table  (ITAB &AFZ)"]
["Crepidula",null,"Fishmeals and solubles ",{"v":91.30000305175781,"d":"91.3"},{"v":47.400001525878906,"d":"47.4"},{"v":0,"d":"0.0"},{"v":2.5999999046325684,"d":"2.6"},{"v":20.100000381469727,"d":"20.1"},{"v":2.6799999237060548,"d":"2.68"},{"v":1.9700000762939454,"d":"1.97"},{"v":0.8899999618530273,"d":"0.89"},{"v":1.4300000190734863,"d":"1.43"},{"v":0,"d":"0.00"},0.55,13.5,{"v":7.400000095367432,"d":"7.4"},{"v":6.800000190734863,"d":"6.8"},{"v":3,"d":"3.0"},{"v":1.100000023841858,"d":"1.1"},{"v":0,"d":"0.00"},{"v":0.45999999046325685,"d":"0.46"},{"v":0,"d":"0.00"},{"v":0,"d":"0.0"},{"v":0,"d":"0.00"},{"v":0,"d":"0.00"},{"v":13.430962343096235,"d":"13.43"},{"v":13.430962343096235,"d":"13.43"},{"v":0,"d":"0.00"},{"v":12.301255230125523,"d":"12.30"},2940,{"v":7.489539748953975,"d":"7.49"},1790,{"v":12.259414225941423,"d":"12.26"},2930,{"v":7.573221757322176,"d":"7.57"},1810,0,0,{"v":0,"d":"0.00"},{"v":0,"d":"0.00"},{"v":0,"d":"0.00"},{"v":0,"d":"0.00"},{"v":0,"d":"0.00"},{"v":0,"d":"0.00"},"Organic table  (ITAB &AFZ)"]
["Faba Bean (coloured flower)",null,"Legume seeds",87.9,25.6,9.1,1.1,3.4,1.67,{"v":0.9199999999999999,"d":"0.92"},0.18,0.51,{"v":0.21000000000000002,"d":"0.21"},0.32,17.2,2.6,25.8,49.9,3.5,0.13,{"v":0.49000000000000005,"d":"0.49"},0.01,2.9,0.16,1.03,{"v":13.347280334728033,"d":"13.35"},{"v":9.07949790794979,"d":"9.08"},1.8,{"v":12.635983263598327,"d":"12.64"},3020,{"v":8.912133891213388,"d":"8.91"},2130,{"v":12.92887029288703,"d":"12.93"},3090,{"v":9.07949790794979,"d":"9.08"},2170,15,10,1.41,0.73,0.15,0.24,0.38,0.15,"Organic table  (ITAB &AFZ)"]
["Faba Bean (white flower)",null,"Legume seeds",84.4,24.4,8.6,{"v":1,"d":"1.0"},3.4,{"v":1.6,"d":"1.60"},{"v":0.8699999999999999,"d":"0.87"},0.18,0.48,{"v":0.2,"d":"0.20"},0.31,17.2,2.6,25.8,49.9,3.5,0.13,{"v":0.47000000000000003,"d":"0.47"},{"v":7.000000000000001E-3,"d":"0.01"},2.8,{"v":0.16999999999999998,"d":"0.17"},1.01,{"v":13.472803347280335,"d":"13.47"},{"v":9.07949790794979,"d":"9.08"},1.8,{"v":0,"d":"0.00"},0,{"v":8.95397489539749,"d":"8.95"},2140,{"v":13.765690376569038,"d":"13.77"},3290,{"v":12.92887029288703,"d":"12.93"},3090,15,10,1.42,0.73,0.15,0.24,0.39,0.15,"Tarasenko N. A, Butina E. A, Gerasimenko E. O. Peculiarities of chemical composition of sainfoin seeds powder. Orient J Chem 2015;31(3) and ICOPP MTT"]
["Fodder beet",null,"Individual component with low DM",16.1,1.3,{"v":1,"d":"1.0"},{"v":0.07,"d":"0.1"},1.7,0.07,0.06,0.02,0.04,0.02,0.01,{"v":0.06,"d":"0.1"},{"v":0,"d":"0.0"},{"v":0.03,"d":"0.0"},0.2,{"v":0.03,"d":"0.0"},0.09,0.04,0.11,{"v":0.04,"d":"0.0"},0.06,{"v":0.5,"d":"0.50"},{"v":2.1,"d":"2.10"},{"v":2.3,"d":"2.30"},0.1,{"v":2.1,"d":"2.10"},490,{"v":1.4,"d":"1.40"},360,{"v":1.4,"d":"1.40"},490,{"v":1.5,"d":"1.50"},340,{"v":0,"d":"0.00"},{"v":0,"d":"0.00"},0.06,0.05,0.02,0.01,0.03,0.01,"INRA table"]
["Grass pea",null,"Legume seeds",87.9,24.2,6.6,0.7,3.1,{"v":0.602,"d":"0.6"},{"v":0.33999999999999997,"d":"0.3"},{"v":0.09,"d":"0.1"},{"v":0.26,"d":"0.3"},{"v":0.09,"d":"0.1"},{"v":0.16999999999999998,"d":"0.2"},10.7,{"v":8.89,"d":"8.9"},19.4,50.4,{"v":6.78,"d":"6.8"},0.03,0.04,0.03,2.3,0.12,{"v":0.9199999999999999,"d":"0.92"},{"v":0,"d":"0.00"},{"v":0,"d":"0.00"},{"v":0,"d":"0.00"},{"v":0,"d":"0.00"},{"v":0,"d":"0.00"},{"v":0,"d":"0.00"},{"v":0,"d":"0.00"},{"v":0,"d":"0.00"},{"v":0,"d":"0.00"},{"v":0,"d":"0.00"},{"v":0,"d":"0.00"},10,15,{"v":0,"d":"0.00"},{"v":0,"d":"0.00"},{"v":0,"d":"0.00"},{"v":0,"d":"0.00"},{"v":0,"d":"0.00"},{"v":0,"d":"0.00"},"INRA table 2002"]
["Hemp cake",null,"Oilseeds (Cake)",90.4,30.4,28.4,11.1,6.1,1.04,1.08,{"v":0.7,"d":"0.70"},1.22,{"v":0.3,"d":"0.30"},0.52,6.6,2.5,11.9,55.1,21.4,0.26,0.95,{"v":0.062,"d":"0.06"},5.7,{"v":0,"d":"0.00"},{"v":0,"d":"0.00"},{"v":11.04602510460251,"d":"11.05"},{"v":12.259414225941423,"d":"12.26"},3.1,{"v":10.209205020920502,"d":"10.21"},2440,{"v":6.610878661087866,"d":"6.61"},1580,{"v":11.213389121338912,"d":"11.21"},2680,{"v":7.154811715481172,"d":"7.15"},1710,20,25,{"v":0.8800000000000001,"d":"0.88"},0.89,0.64,0.41,1.06,{"v":0,"d":"0.00"},"Frech table"]
["Linseed meal, oil > 5%",null,"Oilseeds (Cake)",{"v":90.4000015258789,"d":"90.4"},{"v":33.400001525878906,"d":"33.4"},{"v":7.400000095367432,"d":"7.4"},{"v":12.800000190734863,"d":"12.8"},{"v":4.800000190734863,"d":"4.8"},{"v":1.3100000381469727,"d":"1.31"},{"v":1.2699999809265137,"d":"1.27"},{"v":0.6300000190734864,"d":"0.63"},1.25,{"v":0.5,"d":"0.50"},{"v":0.6199999809265136,"d":"0.62"},{"v":5.599999904632568,"d":"5.6"},{"v":4.400000095367432,"d":"4.4"},{"v":20.200000762939453,"d":"20.2"},{"v":14.699999809265137,"d":"14.7"},{"v":53.79999923706055,"d":"53.8"},{"v":0.3900000095367432,"d":"0.39"},{"v":0.8399999618530274,"d":"0.84"},{"v":0.06200000047683716,"d":"0.06"},5.5,{"v":0.4699999809265137,"d":"0.47"},{"v":1.0199999809265137,"d":"1.02"},{"v":15.857740585774058,"d":"15.86"},{"v":16.317991631799163,"d":"16.32"},6.3,{"v":14.769874476987448,"d":"14.77"},3530,{"v":10.292887029288703,"d":"10.29"},2460,{"v":15.06276150627615,"d":"15.06"},3600,{"v":10.585774058577407,"d":"10.59"},2530,0,10,{"v":10.199999809265137,"d":"10.20"},{"v":9.899999618530273,"d":"9.90"},{"v":5.699999809265137,"d":"5.70"},{"v":4.900000095367432,"d":"4.90"},{"v":10.5,"d":"10.50"},{"v":4.300000190734863,"d":"4.30"},"Organic table  (ITAB &AFZ)"]
["Lithotamne",null,"Minerals",{"v":0,"d":"0.00"},{"v":0,"d":"0.00"},{"v":0,"d":"0.00"},{"v":0,"d":"0.00"},{"v":0,"d":"0.00"},{"v":0,"d":"0.00"},{"v":0,"d":"0.00"},{"v":0,"d":"0.00"},{"v":0,"d":"0.00"},{"v":0,"d":"0.00"},{"v":0,"d":"0.00"},{"v":0,"d":"0.0"},{"v":0,"d":"0.0"},{"v":0,"d":"0.0"},{"v":0,"d":"0.0"},{"v":0,"d":"0.0"},{"v":33,"d":"33.00"},{"v":0,"d":"0.00"},{"v":0,"d":"0.00"},{"v":0,"d":"0.00"},{"v":3.3,"d":"3.30"},{"v":0,"d":"0.00"},{"v":0,"d":"0.00"},{"v":0,"d":"0.00"},{"v":0,"d":"0.00"},{"v":0,"d":"0.00"},{"v":0,"d":"0.00"},{"v":0,"d":"0.00"},{"v":0,"d":"0.00"},{"v":0,"d":"0.00"},{"v":0,"d":"0.00"},{"v":0,"d":"0.00"},{"v":0,"d":"0.00"},5,5,{"v":0,"d":"0.00"},{"v":0,"d":"0.00"},{"v":0,"d":"0.00"},{"v":0,"d":"0.00"},{"v":0,"d":"0.00"},{"v":0,"d":"0.00"}]
["Molasses",null," Other plant product",75.5,10.7,{"v":0,"d":"0.0"},0.2,9.6,0.16,{"v":0.06999999999999999,"d":"0.07"},0.02,0.09,0.08,{"v":0.06999999999999999,"d":"0.07"},{"v":0,"d":"0.0"},{"v":0,"d":"0.0"},{"v":0,"d":"0.0"},{"v":0,"d":"0.0"},{"v":0,"d":"0.0"},0.09,0.02,{"v":0.521,"d":"0.52"},{"v":0.02,"d":"0.0"},0.02,{"v":0,"d":"0.00"},{"v":9.916317991631798,"d":"9.92"},{"v":10.209205020920502,"d":"10.21"},0.2,{"v":9.623430962343097,"d":"9.62"},2300,{"v":6.610878661087866,"d":"6.61"},1580,{"v":9.916317991631798,"d":"9.92"},2370,{"v":6.820083682008368,"d":"6.82"},1630,5,5,0.15,0.06,0.02,0.07,0.09,0.08,"INRA feed table *02"]
["Monocalcium phosphate",null,"Minerals",98.5,{"v":0,"d":"0.00"},{"v":0,"d":"0.00"},{"v":0,"d":"0.00"},80.2,{"v":0,"d":"0.00"},{"v":0,"d":"0.00"},{"v":0,"d":"0.00"},{"v":0,"d":"0.00"},{"v":0,"d":"0.00"},{"v":0,"d":"0.00"},{"v":0,"d":"0.0"},{"v":0,"d":"0.0"},{"v":0,"d":"0.0"},{"v":0,"d":"0.0"},{"v":0,"d":"0.0"},{"v":16.7,"d":"16.70"},{"v":22.4,"d":"22.40"},0.07,{"v":0,"d":"0.00"},0.48,0.23,{"v":0,"d":"0.00"},{"v":0,"d":"0.00"},{"v":0,"d":"0.00"},{"v":0,"d":"0.00"},{"v":0,"d":"0.00"},{"v":0,"d":"0.00"},{"v":0,"d":"0.00"},{"v":0,"d":"0.00"},{"v":0,"d":"0.00"},{"v":0,"d":"0.00"},{"v":0,"d":"0.00"},5,5,{"v":0,"d":"0.00"},{"v":0,"d":"0.00"},{"v":0,"d":"0.00"},{"v":0,"d":"0.00"},{"v":0,"d":"0.00"},{"v":0,"d":"0.00"},"INRA table 2002"]
["Oat","Avoine"," Cereals",{"v":87.8000030517578,"d":"87.8"},{"v":9.399999618530273,"d":"9.4"},{"v":11.199999809265137,"d":"11.2"},{"v":4.599999904632568,"d":"4.6"},{"v":2.5999999046325684,"d":"2.6"},{"v":0.3900000095367432,"d":"0.39"},{"v":0.32999999523162843,"d":"0.33"},{"v":0.17000000476837157,"d":"0.17"},{"v":0.48000001907348633,"d":"0.48"},{"v":0.12000000476837158,"d":"0.12"},{"v":0.3099999904632568,"d":"0.31"},16.5,{"v":1.2000000476837158,"d":"1.2"},{"v":38.599998474121094,"d":"38.6"},{"v":40.900001525878906,"d":"40.9"},{"v":1.600000023841858,"d":"1.6"},{"v":0.1,"d":"0.10"},{"v":0.3200000047683716,"d":"0.32"},{"v":0.012,"d":"0.01"},{"v":1.899999976158142,"d":"1.9"},{"v":0.0899999976158142,"d":"0.09"},0.45,{"v":11.338912133891213,"d":"11.34"},{"v":11.96652719665272,"d":"11.97"},1,{"v":10.92050209205021,"d":"10.92"},2610,{"v":8.158995815899582,"d":"8.16"},1950,{"v":11.380753138075313,"d":"11.38"},2720,{"v":8.535564853556485,"d":"8.54"},2040,10,15,{"v":0.29000000953674315,"d":"0.29"},{"v":0.22999999523162842,"d":"0.23"},{"v":0.13999999761581422,"d":"0.14"},{"v":0.22999999523162842,"d":"0.23"},{"v":0.3799999952316284,"d":"0.38"},{"v":0.0899999976158142,"d":"0.09"},"Organic table  (ITAB &AFZ)"]
["Oat dehulled","Avoine décortiqué"," Cereals",85.7,11.1,3.9,2.6,2.1,{"v":0.45999999999999996,"d":"0.46"},0.39,0.19,0.54,{"v":0.13999999999999999,"d":"0.14"},0.35,3.9,0.3,8.8,8.9,0.4,0.09,0.29,{"v":0.012,"d":"0.01"},1.6,0.09,0.45,{"v":13.514644351464435,"d":"13.51"},{"v":11.96652719665272,"d":"11.97"},0.9,{"v":13.05439330543933,"d":"13.05"},3120,{"v":10.0418410041841,"d":"10.04"},2400,{"v":13.263598326359833,"d":"13.26"},3170,{"v":10.209205020920502,"d":"10.21"},2440,10,15,0.36,0.31,0.16,0.29,{"v":0.45999999999999996,"d":"0.46"},{"v":0.11000000000000001,"d":"0.11"},"INRA feed table 2002"]
["Oat withtout hull","Avoine nue"," Cereals",87.6,9.4,11.6,4.7,2.5,{"v":0.4,"d":"0.40"},{"v":0.32999999999999996,"d":"0.33"},{"v":0.16999999999999998,"d":"0.17"},{"v":0.49000000000000005,"d":"0.49"},0.12,0.31,16.6,1.2,37.1,37.5,1.5,{"v":0.1,"d":"0.10"},0.31,{"v":0.012,"d":"0.01"},1.7,0.09,0.45,{"v":13.514644351464435,"d":"13.51"},{"v":11.96652719665272,"d":"11.97"},1.1,{"v":13.05439330543933,"d":"13.05"},3120,{"v":10.0418410041841,"d":"10.04"},2400,{"v":13.263598326359833,"d":"13.26"},3170,{"v":10.209205020920502,"d":"10.21"},2440,10,15,0.36,0.31,0.16,0.29,{"v":0.45999999999999996,"d":"0.46"},{"v":0.11000000000000001,"d":"0.11"},"INRA feed table 2002"]
["Okara, fat > 5%",null,"Other plant product ",{"v":94.4000015258789,"d":"94.4"},{"v":30.700000762939453,"d":"30.7"},{"v":10,"d":"10.0"},{"v":11.699999809265137,"d":"11.70"},{"v":4.300000190734863,"d":"4.3"},{"v":1.7899999618530273,"d":"1.79"},{"v":1.3100000381469727,"d":"1.31"},{"v":0.4400000095367432,"d":"0.44"},{"v":0.8699999809265136,"d":"0.87"},{"v":0.4199999809265137,"d":"0.42"},{"v":0.43000001907348634,"d":"0.4"},{"v":11.199999809265137,"d":"11.2"},{"v":3.799999952316284,"d":"3.8"},{"v":23.100000381469727,"d":"23.1"},{"v":54,"d":"54.0"},{"v":7.199999809265137,"d":"7.2"},0.35,{"v":0.5199999809265137,"d":"0.52"},{"v":0,"d":"0.00"},{"v":3.0999999046325684,"d":"3.1"},{"v":0,"d":"0.00"},{"v":0,"d":"0.00"},{"v":16.527196652719667,"d":"16.53"},{"v":17.782426778242677,"d":"17.78"},{"v":0,"d":"0.00"},{"v":15.564853556485355,"d":"15.56"},3720,{"v":10.96234309623431,"d":"10.96"},2620,{"v":16.652719665271967,"d":"16.65"},3980,{"v":11.715481171548117,"d":"11.72"},2800,25,{"v":0,"d":"0.00"},{"v":0,"d":"0.00"},{"v":0,"d":"0.00"},{"v":0,"d":"0.00"},{"v":0,"d":"0.00"},{"v":0,"d":"0.00"},{"v":0,"d":"0.00"},"Organic table  (ITAB &AFZ)"]
["Oyster shells",null,"Minerals",99.6,{"v":0,"d":"0.00"},{"v":0,"d":"0.00"},{"v":0,"d":"0.00"},95.8,{"v":0,"d":"0.00"},{"v":0,"d":"0.00"},{"v":0,"d":"0.00"},{"v":0,"d":"0.00"},{"v":0,"d":"0.00"},{"v":0,"d":"0.00"},{"v":0,"d":"0.0"},{"v":0,"d":"0.0"},{"v":0,"d":"0.0"},{"v":0,"d":"0.0"},{"v":0,"d":"0.0"},{"v":35,"d":"35.00"},{"v":0,"d":"0.00"},{"v":5.2,"d":"5.20"},{"v":0,"d":"0.00"},1.01,{"v":0,"d":"0.00"},{"v":0,"d":"0.00"},{"v":0,"d":"0.00"},{"v":0,"d":"0.00"},{"v":0,"d":"0.00"},{"v":0,"d":"0.00"},{"v":0,"d":"0.00"},{"v":0,"d":"0.00"},{"v":0,"d":"0.00"},{"v":0,"d":"0.00"},{"v":0,"d":"0.00"},{"v":0,"d":"0.00"},5,5,{"v":0,"d":"0.00"},{"v":0,"d":"0.00"},{"v":0,"d":"0.00"},{"v":0,"d":"0.00"},{"v":0,"d":"0.00"},{"v":0,"d":"0.00"},"INRA table 2002"]
["Pea (white)",null,"Legume seeds",87.5,20.7,6.1,1.2,{"v":3,"d":"3.0"},1.51,0.79,{"v":0.2,"d":"0.20"},0.48,0.18,{"v":0.27999999999999997,"d":"0.28"},14.3,3.8,24.8,47.3,8.8,{"v":0.11000000000000001,"d":"0.11"},0.43,{"v":0.004,"d":"0.00"},{"v":2,"d":"2.0"},{"v":0.11000000000000001,"d":"0.11"},0.99,{"v":13.93305439330544,"d":"13.93"},{"v":10,"d":"10.00"},{"v":0,"d":"0.00"},{"v":13.263598326359833,"d":"13.26"},3170,{"v":9.707112970711297,"d":"9.71"},2320,{"v":14.476987447698745,"d":"14.48"},3460,{"v":9.832635983263598,"d":"9.83"},2350,10,15,1.25,{"v":0.6,"d":"0.60"},0.16,{"v":0.2,"d":"0.20"},0.36,0.13,"Organic table  (ITAB &AFZ)"]
["Rape oil",null,"Oil",99.9,{"v":0,"d":"0.0"},{"v":0,"d":"0.0"},99.6,0.2,{"v":0,"d":"0.00"},{"v":0,"d":"0.00"},{"v":0,"d":"0.00"},{"v":0,"d":"0.00"},{"v":0,"d":"0.00"},{"v":0,"d":"0.00"},4.8,1.6,59.9,20.4,9.2,{"v":0,"d":"0.00"},{"v":0,"d":"0.00"},{"v":7.000000000000001E-3,"d":"0.01"},{"v":0,"d":"0.00"},{"v":0,"d":"0.00"},{"v":0,"d":"0.00"},{"v":33.30543933054393,"d":"33.31"},{"v":33.30543933054393,"d":"33.31"},{"v":0,"d":"0.00"},{"v":33.13807531380753,"d":"33.14"},7920.000000000001,{"v":29.665271966527197,"d":"29.67"},7090,{"v":33.09623430962343,"d":"33.10"},7910.000000000001,{"v":29.665271966527197,"d":"29.67"},7090,0,4,{"v":0,"d":"0.00"},{"v":0,"d":"0.00"},{"v":0,"d":"0.00"},{"v":0,"d":"0.00"},{"v":0,"d":"0.00"},{"v":0,"d":"0.00"},"INRA feed table 2002"]
["Rapeseed",null,"Legume seeds",92.4,18.7,8.5,{"v":44,"d":"44.0"},{"v":4,"d":"4.0"},1.16,0.89,0.41,{"v":0.8800000000000001,"d":"0.88"},0.24,{"v":0.47000000000000003,"d":"0.47"},4.8,1.6,59.9,20.4,9.2,0.45,0.67,{"v":0.006,"d":"0.01"},4.7,0.24,0.78,{"v":22.09205020920502,"d":"22.09"},{"v":22.594142259414227,"d":"22.59"},2,{"v":21.464435146443513,"d":"21.46"},5130,{"v":17.11297071129707,"d":"17.11"},4089.9999999999995,{"v":21.84100418410042,"d":"21.84"},5220,{"v":17.489539748953973,"d":"17.49"},4180,7,5,{"v":0.9,"d":"0.90"},0.63,{"v":0.32999999999999996,"d":"0.33"},0.37,{"v":0.7,"d":"0.70"},0.18,"INRA feed table 2002"]
["Rapeseed cake (low fat)",null,"Oilseeds (Cake)",90.4,33.4,7.4,12.8,4.8,1.31,1.27,0.63,1.24,{"v":0.5,"d":"0.50"},0.62,5.6,4.4,20.2,14.7,53.8,0.39,{"v":0.8400000000000001,"d":"0.84"},{"v":0.061,"d":"0.06"},5.5,{"v":0.47000000000000003,"d":"0.47"},1.16,{"v":15.857740585774058,"d":"15.86"},{"v":16.317991631799163,"d":"16.32"},1,{"v":14.769874476987448,"d":"14.77"},3530,{"v":10.292887029288703,"d":"10.29"},2460,{"v":15.06276150627615,"d":"15.06"},3600,{"v":10.585774058577407,"d":"10.59"},2530,{"v":0,"d":"0.00"},10,1.02,0.99,{"v":0.5700000000000001,"d":"0.57"},0.48,1.05,0.43,"Organic table  (ITAB &AFZ)"]
["Rapeseed meal, oil > 5%",null,"Legume seeds",91.5,{"v":29.700000762939453,"d":"29.7"},11.5,{"v":14.1999998092651,"d":"14.2"},{"v":6.300000190734863,"d":"6.3"},{"v":1.6399999618530274,"d":"1.64"},{"v":1.3,"d":"1.30"},{"v":0.6,"d":"0.60"},{"v":1.3199999809265137,"d":"1.32"},{"v":0.3700000047683716,"d":"0.37"},{"v":0.7199999809265136,"d":"0.72"},{"v":4.699999809265137,"d":"4.7"},{"v":1.600000023841858,"d":"1.6"},{"v":60.400001525878906,"d":"60.4"},{"v":20,"d":"20.0"},{"v":9.199999809265137,"d":"9.2"},0.75,{"v":1.0899999618530274,"d":"1.09"},{"v":0.050999999046325684,"d":"0.05"},6.5,{"v":0.48000001907348633,"d":"0.48"},{"v":1.1399999618530274,"d":"1.14"},{"v":14.267782426778243,"d":"14.27"},{"v":15.06276150627615,"d":"15.06"},{"v":0,"d":"0.00"},{"v":13.389121338912133,"d":"13.39"},3200,{"v":9.414225941422593,"d":"9.41"},2250,{"v":14.01673640167364,"d":"14.02"},3350,{"v":9.874476987447698,"d":"9.87"},2360,{"v":0,"d":"0.00"},10,{"v":1.2600000381469727,"d":"1.26"},{"v":0.9899999618530273,"d":"0.99"},{"v":0.5400000095367432,"d":"0.54"},{"v":0.5800000190734863,"d":"0.58"},{"v":1.1100000381469726,"d":"1.11"},0.25,"Organic table  (ITAB &AFZ)"]
["Red clover fresh",null,"ndividual component with low DM",27.1,13.7,28.3,3.7,{"v":13,"d":"13.0"},0.38,0.31,{"v":0.06999999999999999,"d":"0.07"},{"v":0,"d":"0.00"},{"v":0,"d":"0.00"},{"v":0,"d":"0.00"},{"v":0,"d":"0.0"},{"v":0,"d":"0.0"},{"v":0,"d":"0.0"},{"v":0,"d":"0.0"},{"v":0,"d":"0.0"},0.91,0.26,0.03,{"v":0.02,"d":"0.0"},0.21,3.41,{"v":7.2,"d":"7.20"},{"v":0,"d":"0.00"},{"v":0,"d":"0.00"},{"v":6.7,"d":"6.70"},{"v":0,"d":"0.00"},{"v":4,"d":"4.00"},{"v":0,"d":"0.00"},{"v":7.9,"d":"7.90"},{"v":0,"d":"0.00"},{"v":4.8,"d":"4.80"},{"v":0,"d":"0.00"},{"v":0,"d":"0.00"},{"v":0,"d":"0.00"},0.27,0.22,0.13,0.03,{"v":0,"d":"0.00"},{"v":0,"d":"0.00"},"ICOPP MTT"]
["Rice protein concentrate",null," Other plant product",{"v":94.80000305175781,"d":"94.8"},46.5,{"v":1.2000000476837158,"d":"1.2"},{"v":3.5999999046325684,"d":"3.6"},{"v":2.299999952316284,"d":"2.3"},{"v":1.4699999809265136,"d":"1.47"},{"v":1.6899999618530273,"d":"1.69"},{"v":1.3300000190734864,"d":"1.33"},2.35,{"v":0.6199999809265136,"d":"0.62"},{"v":1.0199999809265137,"d":"1.0"},{"v":18.799999237060547,"d":"18.8"},{"v":2.0999999046325684,"d":"2.1"},{"v":39.900001525878906,"d":"39.9"},{"v":35.79999923706055,"d":"35.8"},1.5,{"v":0.1,"d":"0.10"},0.45,{"v":0.09599999785423279,"d":"0.10"},{"v":3.9000000953674316,"d":"3.9"},{"v":0.04000000059604645,"d":"0.04"},{"v":0.020000000298023225,"d":"0.02"},{"v":16.86192468619247,"d":"16.86"},{"v":17.280334728033473,"d":"17.28"},{"v":0,"d":"0.00"},{"v":15.397489539748953,"d":"15.40"},3680,{"v":9.748953974895397,"d":"9.75"},2330,{"v":15.523012552301255,"d":"15.52"},3710,{"v":10.083682008368202,"d":"10.08"},2410,{"v":0,"d":"0.00"},{"v":0,"d":"0.00"},{"v":0,"d":"0.00"},{"v":0,"d":"0.00"},{"v":0,"d":"0.00"},{"v":0,"d":"0.00"},{"v":0,"d":"0.00"},{"v":0,"d":"0.00"},"Organic table  (ITAB &AFZ)"]
["Pea (coloured)",null,"Legume seeds",86.1,{"v":21,"d":"21.0"},6.2,1.3,2.7,1.52,0.79,{"v":0.2,"d":"0.20"},0.48,0.18,{"v":0.27999999999999997,"d":"0.28"},14.3,3.8,24.8,47.3,8.8,{"v":0.22000000000000003,"d":"0.22"},{"v":0.42000000000000004,"d":"0.42"},{"v":0.004,"d":"0.00"},1.9,0.15,0.99,{"v":13.723849372384937,"d":"13.72"},{"v":9.832635983263598,"d":"9.83"},2,{"v":13.096234309623432,"d":"13.10"},3130,{"v":9.497907949790795,"d":"9.50"},2270,{"v":13.556485355648535,"d":"13.56"},3240,{"v":9.832635983263598,"d":"9.83"},2350,10,15,1.16,0.53,0.12,{"v":0.2,"d":"0.20"},0.32,{"v":0.11000000000000001,"d":"0.11"},"Organic table  (ITAB &AFZ)"]
["Rye","Seigle","Cereals",84.2,9.3,2.1,1.1,1.7,0.35,0.32,0.15,0.36,0.08,0.21,14.9,0.8,18.1,57.7,7.1,0.06,0.29,0.03,1.9,{"v":0.1,"d":"0.10"},{"v":0.44000000000000006,"d":"0.44"},{"v":12.761506276150628,"d":"12.76"},{"v":13.05439330543933,"d":"13.05"},0.9,{"v":12.343096234309623,"d":"12.34"},2950,{"v":9.497907949790795,"d":"9.50"},2270,{"v":12.552301255230125,"d":"12.55"},3000,{"v":9.707112970711297,"d":"9.71"},2320,0,50,0.25,{"v":0.22000000000000003,"d":"0.22"},0.12,0.18,{"v":0.3,"d":"0.30"},0.06,"Organic table  (ITAB &AFZ)"]
["Sainfoin",null,"Legume seeds",93.4,31.2,19.4,6.9,5.1,0.53,0.35,0.18,{"$f":"0.35+0.18","v":0.53},{"v":0,"d":"0.00"},0.13,{"v":7.43,"d":"7.4"},{"v":3.06,"d":"3.1"},{"v":24.95,"d":"25.0"},{"v":18.77,"d":"18.8"},{"v":41.31,"d":"41.3"},0.76,0.55,{"v":0.003,"d":"0.00"},6.2,0.18,1.09,{"v":13.9,"d":"13.90"},{"v":14.7,"d":"14.70"},{"v":0,"d":"0.00"},{"v":13.1,"d":"13.10"},{"$f":"Swine5[[#This Row],[ME growing pig Mj/kg ]]*239","v":3130.9},{"v":9.1,"d":"9.10"},{"$f":"Swine5[[#This Row],[NE growing pig Mj/kg ]]*239","v":2174.9},{"v":13.8,"d":"13.80"},{"$f":"Swine5[[#This Row],[ME pig adult Mj/kg ]]*239","v":3298.2000000000003},{"v":9.5,"d":"9.50"},{"$f":"Swine5[[#This Row],[NE pig adult  Mj/kg ]]*239","v":2270.5},10,20,1.45,{"v":0,"d":"0.00"},{"v":0,"d":"0.00"},{"v":0,"d":"0.00"},{"v":0,"d":"0.00"},{"v":0,"d":"0.00"},"Tarasenko N. A, Butina E. A, Gerasimenko E. O. Peculiarities of chemical composition of sainfoin seeds powder. Orient J Chem 2015;31(3) and ICOPP MTT"]
["Sesame oil meal, oil > 5%",null,"Oilseeds (Cake)",{"v":93.5999984741211,"d":"93.6"},{"v":43.20000076293945,"d":"43.2"},{"v":6.599999904632568,"d":"6.6"},{"v":14.300000190734863,"d":"14.3"},{"v":8.600000381469727,"d":"8.6"},{"v":1.0100000381469727,"d":"1.01"},{"v":1.2800000190734864,"d":"1.28"},{"v":1.1100000381469726,"d":"1.11"},{"v":1.8799999237060547,"d":"1.88"},{"v":0.48000001907348633,"d":"0.48"},{"v":0.7699999809265137,"d":"0.8"},{"v":8.800000190734863,"d":"8.8"},{"v":4.900000095367432,"d":"4.9"},{"v":38.900001525878906,"d":"38.9"},{"v":43.70000076293945,"d":"43.7"},{"v":0.4000000059604645,"d":"0.4"},{"v":1.8700000762939453,"d":"1.87"},1.15,{"v":0.005999999865889549,"d":"0.01"},{"v":8.600000381469727,"d":"8.6"},{"v":0.5599999904632569,"d":"0.56"},{"v":0.9699999809265136,"d":"0.97"},{"v":16.02510460251046,"d":"16.03"},{"v":16.569037656903767,"d":"16.57"},{"v":3.299999952316284,"d":"3.3"},{"v":14.769874476987448,"d":"14.77"},3530,{"v":10.209205020920502,"d":"10.21"},2440,{"v":15.188284518828452,"d":"15.19"},3630,{"v":10.502092050209205,"d":"10.50"},2510,5,10,{"v":0,"d":"0.00"},{"v":0,"d":"0.00"},{"v":0,"d":"0.00"},{"v":0,"d":"0.00"},{"v":0,"d":"0.00"},{"v":0,"d":"0.00"},"Organic table  (ITAB &AFZ)"]
["Sodium chlorite",null,"Minerals",99.6,{"v":0,"d":"0.0"},{"v":0,"d":"0.0"},{"v":0,"d":"0.0"},99.3,{"v":0,"d":"0.00"},{"v":0,"d":"0.00"},{"v":0,"d":"0.00"},{"v":0,"d":"0.00"},{"v":0,"d":"0.00"},{"v":0,"d":"0.00"},{"v":0,"d":"0.0"},{"v":0,"d":"0.0"},{"v":0,"d":"0.0"},{"v":0,"d":"0.0"},{"v":0,"d":"0.0"},{"v":0,"d":"0.00"},{"v":0,"d":"0.00"},{"v":38,"d":"38.00"},null,{"v":0,"d":"0.00"},{"v":0,"d":"0.00"},{"v":0,"d":"0.00"},{"v":0,"d":"0.00"},{"v":0,"d":"0.00"},{"v":0,"d":"0.00"},{"v":0,"d":"0.00"},{"v":0,"d":"0.00"},{"v":0,"d":"0.00"},{"v":0,"d":"0.00"},{"v":0,"d":"0.00"},{"v":0,"d":"0.00"},{"v":0,"d":"0.00"},5,5,{"v":0,"d":"0.00"},{"v":0,"d":"0.00"},{"v":0,"d":"0.00"},{"v":0,"d":"0.00"},{"v":0,"d":"0.00"},{"v":0,"d":"0.00"},"Organic table  (ITAB &AFZ)"]
["Sorghum ","Sorghum","Cereals",{"v":87.69999694824219,"d":"87.7"},{"v":9,"d":"9.0"},3.5,{"v":2.9000000953674316,"d":"2.9"},{"v":1.899999976158142,"d":"1.9"},{"v":2.200000047683716,"d":"2.20"},{"v":3,"d":"3.00"},{"v":1.5,"d":"1.50"},{"v":3.200000047683716,"d":"3.20"},{"v":0.8999999761581421,"d":"0.90"},{"v":1.7000000476837158,"d":"1.70"},{"v":14.300000190734863,"d":"14.3"},{"v":1.7000000476837158,"d":"1.7"},{"v":38.20000076293945,"d":"38.2"},{"v":42.20000076293945,"d":"42.2"},{"v":1.7999999523162842,"d":"1.8"},{"v":0.030000001192092896,"d":"0.03"},{"v":0.3,"d":"0.30"},{"v":0.015999999642372132,"d":"0.02"},{"v":2.0999999046325684,"d":"2.1"},0.15,{"v":0.3599999904632568,"d":"0.36"},{"v":14.225941422594142,"d":"14.23"},{"v":14.518828451882845,"d":"14.52"},0.8,{"v":13.891213389121338,"d":"13.89"},3320,{"v":10.92050209205021,"d":"10.92"},2610,{"v":14.100418410041842,"d":"14.10"},3370,{"v":11.087866108786612,"d":"11.09"},2650,40,80,{"v":0.1600000023841858,"d":"0.16"},{"v":0.2200000047683716,"d":"0.22"},{"v":0.12999999523162842,"d":"0.13"},{"v":0.12999999523162842,"d":"0.13"},{"v":0.25999999046325684,"d":"0.26"},{"v":0.06999999880790711,"d":"0.07"},"Organic table  (ITAB &AFZ)"]
["Soya bean ",null,"Legume seeds",{"v":88.19999694824219,"d":"88.2"},{"v":35.70000076293945,"d":"35.7"},{"v":6.300000190734863,"d":"6.3"},{"v":18.600000381469727,"d":"18.6"},{"v":4.599999904632568,"d":"4.6"},{"v":2.220000076293945,"d":"2.22"},{"v":1.4399999618530273,"d":"1.44"},{"v":0.5199999809265137,"d":"0.52"},{"v":1.0399999618530273,"d":"1.04"},0.45,{"v":0.5300000190734864,"d":"0.53"},{"v":11.199999809265137,"d":"11.2"},{"v":3.799999952316284,"d":"3.8"},{"v":23.100000381469727,"d":"23.1"},{"v":54,"d":"54.0"},{"v":7.199999809265137,"d":"7.2"},{"v":0.29000000953674315,"d":"0.29"},{"v":0.5400000095367432,"d":"0.54"},{"v":0.006,"d":"0.01"},{"v":3.299999952316284,"d":"3.3"},{"v":0.2,"d":"0.20"},{"v":1.6600000000000001,"d":"1.66"},{"v":20.3,"d":"20.30"},{"v":0,"d":"0.00"},{"v":0,"d":"0.00"},{"v":19.3,"d":"19.30"},{"$f":"239*Swine5[[#This Row],[ME growing pig Mj/kg ]]","v":4612.7},{"v":14,"d":"14.00"},{"$f":"Swine5[[#This Row],[NE growing pig Mj/kg ]]*239","v":3346},{"v":0,"d":"0.00"},0,{"v":0,"d":"0.00"},0,15,10,{"v":1.2699999809265137,"d":"1.27"},{"v":0.7099999904632568,"d":"0.71"},{"v":0.3200000047683716,"d":"0.32"},{"v":0.1799999952316284,"d":"0.18"},{"v":0.5,"d":"0.50"},{"v":0.12999999523162842,"d":"0.13"},"Organic table  (ITAB &AFZ)"]
["Soya bean thermically treated",null,"Legume seeds",{"v":90.69999694824219,"d":"90.7"},{"v":37.599998474121094,"d":"37.6"},{"v":4.199999809265137,"d":"4.2"},17.5,{"v":5.199999809265137,"d":"5.2"},{"v":2.339999961853027,"d":"2.34"},{"v":1.5100000381469727,"d":"1.51"},{"v":0.5400000095367432,"d":"0.54"},{"v":1.1,"d":"1.10"},{"v":0.48000001907348633,"d":"0.48"},{"v":0.5599999904632569,"d":"0.56"},{"v":11.199999809265137,"d":"11.2"},{"v":3.799999952316284,"d":"3.8"},{"v":23.100000381469727,"d":"23.1"},{"v":54,"d":"54.0"},{"v":7.199999809265137,"d":"7.2"},{"v":0.3,"d":"0.30"},0.55,{"v":0.005,"d":"0.01"},{"v":3.299999952316284,"d":"3.3"},{"v":0.22999999523162842,"d":"0.23"},1.83,{"v":16.276150627615063,"d":"16.28"},{"v":17.698744769874477,"d":"17.70"},{"v":1.7999999523162842,"d":"1.8"},{"v":15.271966527196653,"d":"15.27"},3650,{"v":11.087866108786612,"d":"11.09"},2650,{"v":16.485355648535563,"d":"16.49"},3939.9999999999995,{"v":11.882845188284518,"d":"11.88"},2840,15,10,{"v":1.8399999618530274,"d":"1.84"},{"v":1.1399999618530274,"d":"1.14"},{"v":0.4199999809265137,"d":"0.42"},{"v":0.4199999809265137,"d":"0.42"},{"v":0.8399999618530274,"d":"0.84"},{"v":0.4,"d":"0.40"},"Organic table  (ITAB &AFZ)"]
["Soya bean toasted",null,"Legume seeds","88.6.",35.7,5.8,19.7,4.9,{"v":2.2199999999999998,"d":"2.22"},1.44,0.52,1.04,0.45,0.53,10.5,3.8,21.7,53.1,7.4,{"v":0.3,"d":"0.30"},0.53,{"v":0.006,"d":"0.01"},3.2,{"v":0.22000000000000003,"d":"0.22"},1.75,{"v":16.401673640167363,"d":"16.40"},{"v":17.782426778242677,"d":"17.78"},1.7,{"v":15.439330543933055,"d":"15.44"},3690,{"v":11.338912133891213,"d":"11.34"},2710,{"v":16.652719665271967,"d":"16.65"},3980,{"v":12.133891213389122,"d":"12.13"},2900,15,10,1.75,1.09,{"v":0.4,"d":"0.40"},{"v":0.4,"d":"0.40"},{"v":0.8,"d":"0.80"},0.38,"INRA feed table 2002"]
["Soya oil",null,"Oil",99.8,{"v":0,"d":"0.0"},{"v":0,"d":"0.0"},99.7,{"v":0,"d":"0.0"},{"v":0,"d":"0.00"},{"v":0,"d":"0.00"},{"v":0,"d":"0.00"},{"v":0,"d":"0.00"},{"v":0,"d":"0.00"},{"v":0,"d":"0.00"},10.5,3.8,21.7,53.1,7.4,{"v":0,"d":"0.00"},{"v":0,"d":"0.00"},{"v":0.008,"d":"0.01"},{"v":0,"d":"0.0"},{"v":0,"d":"0.00"},0.02,{"v":33.26359832635983,"d":"33.26"},{"v":33.26359832635983,"d":"33.26"},{"v":0,"d":"0.00"},{"v":33.09623430962343,"d":"33.10"},7910.000000000001,{"v":29.707112970711297,"d":"29.71"},7100,{"v":33.05439330543933,"d":"33.05"},7900.000000000001,{"v":29.707112970711297,"d":"29.71"},7100,{"v":0,"d":"0.00"},4,{"v":0,"d":"0.00"},{"v":0,"d":"0.00"},{"v":0,"d":"0.00"},{"v":0,"d":"0.00"},{"v":0,"d":"0.00"},{"v":0,"d":"0.00"},"INRA feed table 2002"]
["Soyabean cake (high protein)",null,"Oilseeds (Cake)",{"v":94.4000015258789,"d":"94.4"},{"v":46.20000076293945,"d":"46.2"},{"v":5.900000095367432,"d":"5.9"},{"v":8.699999809265137,"d":"8.7"},{"v":6.199999809265137,"d":"6.2"},{"v":2.6,"d":"2.60"},{"v":1.7899999618530273,"d":"1.79"},{"v":0.6599999904632569,"d":"0.66"},{"v":1.3800000190734862,"d":"1.38"},{"v":0.6300000190734864,"d":"0.63"},{"v":0.7099999904632568,"d":"0.71"},{"v":11.199999809265137,"d":"11.2"},{"v":3.799999952316284,"d":"3.8"},{"v":23.100000381469727,"d":"23.1"},{"v":54,"d":"54.0"},{"v":7.199999809265137,"d":"7.2"},0.35,{"v":0.6599999904632569,"d":"0.66"},{"v":0,"d":"0.00"},{"v":3.9000000953674316,"d":"3.9"},{"v":0.27999999523162844,"d":"0.28"},{"v":2.1200000762939455,"d":"2.12"},{"v":17.11297071129707,"d":"17.11"},{"v":18.07531380753138,"d":"18.08"},{"v":2.09999990463256,"d":"2.1"},{"v":15.815899581589958,"d":"15.82"},3780,{"v":10.334728033472803,"d":"10.33"},2470,{"v":16.569037656903767,"d":"16.57"},3960.0000000000005,{"v":10.96234309623431,"d":"10.96"},2620,10,25,2.35,{"v":1.5600000381469727,"d":"1.56"},{"v":0.6,"d":"0.60"},{"v":0.6199999809265136,"d":"0.62"},{"v":1.2300000190734863,"d":"1.23"},{"v":0.5599999904632569,"d":"0.56"},"Organic table  (ITAB &AFZ)"]
["Soyabean cake (low protein)",null,"Oilseeds (Cake)",{"v":92.5999984741211,"d":"92.6"},{"v":42,"d":"42.0"},{"v":6.099999904632568,"d":"6.1"},{"v":8.899999618530273,"d":"8.9"},{"v":6,"d":"6.0"},{"v":2.3700000762939455,"d":"2.37"},1.65,{"v":0.6,"d":"0.60"},{"v":1.2399999618530273,"d":"1.24"},{"v":0.5599999904632569,"d":"0.56"},{"v":0.6400000095367432,"d":"0.64"},{"v":11.199999809265137,"d":"11.2"},{"v":3.799999952316284,"d":"3.8"},{"v":23.100000381469727,"d":"23.1"},{"v":54,"d":"54.0"},{"v":7.199999809265137,"d":"7.2"},{"v":0.34000000953674314,"d":"0.34"},{"v":0.6400000095367432,"d":"0.64"},{"v":1E-3,"d":"0.00"},{"v":3.799999952316284,"d":"3.8"},{"v":0.2700000047683716,"d":"0.27"},2.05,{"v":16.652719665271967,"d":"16.65"},{"v":17.615062761506277,"d":"17.62"},{"v":2,"d":"2.0"},{"v":15.439330543933055,"d":"15.44"},3690,{"v":10.209205020920502,"d":"10.21"},2440,{"v":16.192468619246863,"d":"16.19"},3870.0000000000005,{"v":10.836820083682008,"d":"10.84"},2590,10,25,{"v":2.1299999237060545,"d":"2.13"},1.4300000190734863,0.55,0.55,1.1,0.5,"Organic table  (ITAB &AFZ)"]
["Spelt organic",null,"Cereals",{"v":86.9000015258789,"d":"86.9"},{"v":9.899999618530273,"d":"9.9"},{"v":11.100000381469727,"d":"11.1"},{"v":1.2999999523162842,"d":"1.3"},{"v":2.700000047683716,"d":"2.7"},{"v":3,"d":"3.00"},{"v":3,"d":"3.00"},{"v":1.600000023841858,"d":"1.60"},{"v":3.9000000953674316,"d":"3.90"},{"v":1.2000000476837158,"d":"1.20"},{"v":2.299999952316284,"d":"2.30"},{"v":17.799999237060547,"d":"17.8"},{"v":0.800000011920929,"d":"0.8"},{"v":15.199999809265137,"d":"15.2"},{"v":56.400001525878906,"d":"56.4"},{"v":5.900000095367432,"d":"5.9"},{"v":0.0800000011920929,"d":"0.08"},{"v":0.3700000047683716,"d":"0.37"},{"v":0.010999999940395355,"d":"0.01"},{"v":2.4000000953674316,"d":"2.4"},{"v":0.1600000023841858,"d":"0.16"},{"v":0.1899999976158142,"d":"0.19"},{"v":7.531380753138075,"d":"7.53"},{"v":8.744769874476987,"d":"8.74"},{"v":0,"d":"0.00"},{"v":7.322175732217573,"d":"7.32"},1750,{"v":6.192468619246862,"d":"6.19"},1480,{"v":8.493723849372385,"d":"8.49"},2030,{"v":6.694560669456067,"d":"6.69"},1600,{"v":0,"d":"0.00"},{"v":0,"d":"0.00"},{"v":0,"d":"0.00"},{"v":0,"d":"0.00"},{"v":0,"d":"0.00"},{"v":0,"d":"0.00"},{"v":0,"d":"0.00"},{"v":0,"d":"0.00"},"Organic table  (ITAB &AFZ)"]
["Sunflower bean",null,"Legume seeds",{"v":93.5999984741211,"d":"93.6"},{"v":15.199999809265137,"d":"15.2"},{"v":14.399999618530273,"d":"14.4"},{"v":45.099998474121094,"d":"45.1"},{"v":3.0999999046325684,"d":"3.1"},{"v":0.6199999809265136,"d":"0.62"},{"v":0.5800000190734863,"d":"0.58"},0.35,{"v":0.6099999904632568,"d":"0.61"},{"v":0.20999999046325685,"d":"0.21"},{"v":0.2700000047683716,"d":"0.27"},{"v":6.400000095367432,"d":"6.4"},{"v":4.300000190734863,"d":"4.3"},{"v":20.200000762939453,"d":"20.2"},{"v":65.19999694824219,"d":"65.2"},{"v":0.30000001192092896,"d":"0.3"},{"v":0.25999999046325684,"d":"0.26"},{"v":0.5099999904632568,"d":"0.51"},{"v":0.005,"d":"0.01"},{"v":4.300000190734863,"d":"4.3"},{"v":0.2700000047683716,"d":"0.27"},0.77,{"v":19.581589958158997,"d":"19.58"},{"v":20.376569037656903,"d":"20.38"},{"v":0,"d":"0.00"},{"v":19.03765690376569,"d":"19.04"},4550,{"v":15.899581589958158,"d":"15.90"},3800,{"v":19.665271966527197,"d":"19.67"},4700,{"v":16.192468619246863,"d":"16.19"},3870.0000000000005,{"v":0,"d":"0.00"},{"v":0,"d":"0.00"},{"v":0,"d":"0.00"},{"v":0,"d":"0.00"},{"v":0,"d":"0.00"},{"v":0,"d":"0.00"},{"v":0,"d":"0.00"},0,"Organic table  (ITAB &AFZ)"]
["Sunflower cake (dehulled)",null,"Oilseeds (Cake)",93.8,33.7,18.5,8.8,6.2,1.21,1.22,0.76,{"v":1.3199999999999998,"d":"1.32"},0.43,{"v":0.5700000000000001,"d":"0.57"},6.3,4.3,20.3,64.9,0.3,0.39,0.99,{"v":0,"d":"0.00"},8.4,{"v":0.49000000000000005,"d":"0.49"},{"v":1.3199999999999998,"d":"1.32"},{"v":12.594142259414227,"d":"12.59"},{"v":13.640167364016737,"d":"13.64"},1.9,{"v":11.673640167364017,"d":"11.67"},2790,{"v":7.656903765690377,"d":"7.66"},1830,{"v":12.510460251046025,"d":"12.51"},2990,{"v":8.158995815899582,"d":"8.16"},1950,5,20,{"v":1,"d":"1.00"},0.99,{"v":0.6900000000000001,"d":"0.69"},{"v":0.47000000000000003,"d":"0.47"},1.16,0.36,"INRA feed table 2002"]
["Sunflower cake (high protein)",null,"Oilseeds (Cake)",{"v":94.19999694824219,"d":"94.2"},{"v":33.29999923706055,"d":"33.3"},{"v":18.899999618530273,"d":"18.9"},{"v":8.600000381469727,"d":"8.6"},{"v":6,"d":"6.0"},{"v":1.2,"d":"1.20"},{"v":1.2,"d":"1.20"},0.75,{"v":1.3100000381469727,"d":"1.31"},{"v":0.4199999809265137,"d":"0.42"},{"v":0.5599999904632569,"d":"0.56"},{"v":6.400000095367432,"d":"6.4"},{"v":4.300000190734863,"d":"4.3"},{"v":20.200000762939453,"d":"20.2"},{"v":65.19999694824219,"d":"65.2"},{"v":0.30000001192092896,"d":"0.3"},{"v":0.3900000095367432,"d":"0.39"},{"v":0.9699999809265136,"d":"0.97"},{"v":0.012,"d":"0.01"},{"v":8.300000190734863,"d":"8.3"},{"v":0.48000001907348633,"d":"0.48"},1.41,{"v":12.552301255230125,"d":"12.55"},{"v":13.598326359832637,"d":"13.60"},{"v":1.7999999523162842,"d":"1.8"},{"v":11.631799163179917,"d":"11.63"},2780,{"v":7.656903765690377,"d":"7.66"},1830,{"v":12.468619246861925,"d":"12.47"},2980,{"v":8.158995815899582,"d":"8.16"},1950,5,20,1,0.9899999618530273,0.6800000190734863,0.45999999046325685,1.1399999618530274,0.3599999904632568,"Organic table  (ITAB &AFZ)"]
["Sunflower cake (low protein)",null,"Oilseeds (Cake)",{"v":92.30000305175781,"d":"92.3"},{"v":24.100000381469727,"d":"24.1"},{"v":24.600000381469727,"d":"24.6"},{"v":14.899999618530273,"d":"14.9"},{"v":5.300000190734863,"d":"5.3"},{"v":0.9,"d":"0.90"},{"v":0.8899999618530273,"d":"0.89"},{"v":0.5400000095367432,"d":"0.54"},{"v":0.9600000381469727,"d":"0.96"},{"v":0.3099999904632568,"d":"0.31"},{"v":0.40999999046325686,"d":"0.41"},{"v":6.400000095367432,"d":"6.4"},{"v":4.300000190734863,"d":"4.3"},{"v":20.200000762939453,"d":"20.2"},{"v":65.19999694824219,"d":"65.2"},{"v":0.30000001192092896,"d":"0.3"},{"v":0.3599999904632568,"d":"0.36"},0.85,{"v":1E-3,"d":"0.00"},{"v":7.199999809265137,"d":"7.2"},{"v":0.4199999809265137,"d":"0.42"},1.25,{"v":11.297071129707113,"d":"11.30"},{"v":12.594142259414227,"d":"12.59"},{"v":1.600000023841858,"d":"1.6"},{"v":10.627615062761507,"d":"10.63"},2540,{"v":7.615062761506276,"d":"7.62"},1820,{"v":11.673640167364017,"d":"11.67"},2790,{"v":8.158995815899582,"d":"8.16"},1950,5,20,{"v":0.6900000095367431,"d":"0.69"},0.65,0.4699999809265137,0.3,0.7599999904632568,0.24000000953674316,"Organic table  (ITAB &AFZ)"]
["Sunflower oil",null,"Oil",99.3,{"v":0,"d":"0.0"},{"v":0,"d":"0.0"},99.5,{"v":0.05,"d":"0.1"},{"v":0,"d":"0.00"},{"v":0,"d":"0.00"},{"v":0,"d":"0.00"},{"v":0,"d":"0.00"},{"v":0,"d":"0.00"},{"v":0,"d":"0.00"},6.3,4.3,20.3,64.9,0.3,{"v":0,"d":"0.00"},{"v":0,"d":"0.00"},{"v":0.008,"d":"0.01"},{"v":0,"d":"0.0"},{"v":0,"d":"0.00"},{"v":0,"d":"0.00"},{"v":33.09623430962343,"d":"33.10"},{"v":33.09623430962343,"d":"33.10"},{"v":0,"d":"0.00"},{"v":32.92887029288703,"d":"32.93"},7869.999999999999,{"v":29.623430962343097,"d":"29.62"},7080,{"v":32.88702928870293,"d":"32.89"},7859.999999999999,{"v":29.623430962343097,"d":"29.62"},7080,{"v":0,"d":"0.00"},{"v":0,"d":"0.00"},{"v":0,"d":"0.00"},{"v":0,"d":"0.00"},{"v":0,"d":"0.00"},{"v":0,"d":"0.00"},{"v":0,"d":"0.00"},{"v":0,"d":"0.00"},"INRA feed table 2002"]
["Triticale 10,9% CP","Triticale 10,9% MAT","Cereals",{"v":87,"d":"87.0"},10.9,2.9,1.5,1.7,0.43,0.36,0.19,{"v":0.47000000000000003,"d":"0.47"},{"v":0.13999999999999999,"d":"0.14"},0.29,{"v":17,"d":"17.0"},0.9,13.5,60.8,7.1,0.06,{"v":0.32999999999999996,"d":"0.33"},{"v":0.006,"d":"0.01"},2.5,{"v":0.11000000000000001,"d":"0.11"},{"v":0.5,"d":"0.50"},{"v":13.640167364016737,"d":"13.64"},{"v":13.891213389121338,"d":"13.89"},1.1,{"v":13.221757322175732,"d":"13.22"},3160,{"v":10.292887029288703,"d":"10.29"},2460,{"v":13.389121338912133,"d":"13.39"},3200,{"v":10.418410041841005,"d":"10.42"},2490,30,50,{"v":0.32999999999999996,"d":"0.33"},0.27,0.16,0.24,0.39,{"v":0.11000000000000001,"d":"0.11"},"Organic table  (ITAB &AFZ)"]
["Triticale 7,9% CP","Triticale 7,9% MAT","Cereals",{"v":87,"d":"87.0"},7.9,2.9,1.5,1.7,0.31,0.26,{"v":0.13999999999999999,"d":"0.14"},{"v":0.33999999999999997,"d":"0.34"},{"v":0.1,"d":"0.10"},{"v":0.21000000000000002,"d":"0.21"},{"v":17,"d":"17.0"},0.9,13.5,60.8,7.1,0.06,{"v":0.32999999999999996,"d":"0.33"},{"v":0.006,"d":"0.01"},2.5,{"v":0.11000000000000001,"d":"0.11"},{"v":0.5,"d":"0.50"},{"v":13.389121338912133,"d":"13.39"},{"v":13.723849372384937,"d":"13.72"},1.1,{"v":13.138075313807532,"d":"13.14"},3140,{"v":10.083682008368202,"d":"10.08"},2410,{"v":13.305439330543933,"d":"13.31"},3180,{"v":10.209205020920502,"d":"10.21"},2440,30,50,{"v":0.32999999999999996,"d":"0.33"},0.27,0.16,0.24,0.39,{"v":0.11000000000000001,"d":"0.11"},"Organic table  (ITAB &AFZ)"]
["Triticale 8,9% CP","Triticale 8,9% MAT","Cereals",{"v":87,"d":"87.0"},8.9,2.9,1.5,1.7,0.35,{"v":0.3,"d":"0.30"},0.15,0.39,0.12,{"v":0.22999999999999998,"d":"0.23"},{"v":17,"d":"17.0"},0.9,13.5,60.8,7.1,0.06,{"v":0.32999999999999996,"d":"0.33"},{"v":0.006,"d":"0.01"},2.5,{"v":0.11000000000000001,"d":"0.11"},{"v":0.5,"d":"0.50"},{"v":13.556485355648535,"d":"13.56"},{"v":13.807531380753138,"d":"13.81"},1.1,{"v":13.179916317991632,"d":"13.18"},3150,{"v":10.292887029288703,"d":"10.29"},2460,{"v":13.347280334728033,"d":"13.35"},3190,{"v":10.376569037656903,"d":"10.38"},2480,30,50,{"v":0.32999999999999996,"d":"0.33"},0.27,0.16,0.24,0.39,{"v":0.11000000000000001,"d":"0.11"},"Organic table  (ITAB &AFZ)"]
["Triticale 9,9% CP","Triticale 9,9% MAT","Cereals",{"v":87,"d":"87.0"},9.9,2.9,1.5,1.7,0.39,{"v":0.32999999999999996,"d":"0.33"},{"v":0.16999999999999998,"d":"0.17"},0.43,0.13,0.26,{"v":17,"d":"17.0"},0.9,13.5,60.8,7.1,0.06,{"v":0.32999999999999996,"d":"0.33"},{"v":0.006,"d":"0.01"},2.5,{"v":0.11000000000000001,"d":"0.11"},{"v":0.5,"d":"0.50"},{"v":13.347280334728033,"d":"13.35"},{"v":13.640167364016737,"d":"13.64"},1.1,{"v":12.97071129707113,"d":"12.97"},3100,{"v":10.167364016736402,"d":"10.17"},2430,{"v":13.179916317991632,"d":"13.18"},3150,{"v":10.292887029288703,"d":"10.29"},2460,30,50,{"v":0.32999999999999996,"d":"0.33"},0.27,0.16,0.24,0.39,{"v":0.11000000000000001,"d":"0.11"},"Organic table  (ITAB &AFZ)"]
["Vetch common",null,"Legume seeds",{"v":90.9000015258789,"d":"90.9"},{"v":27.200000762939453,"d":"27.2"},{"v":5.900000095367432,"d":"5.9"},{"v":1,"d":"1.0"},{"v":2.9000000953674316,"d":"2.9"},1.75,{"v":1.0199999809265137,"d":"1.02"},{"v":0.2200000047683716,"d":"0.22"},{"v":0.6599999904632569,"d":"0.66"},{"v":0.24000000953674316,"d":"0.24"},{"v":0.4400000095367432,"d":"0.4"},{"v":19.899999618530273,"d":"19.9"},{"v":4.800000190734863,"d":"4.8"},{"v":8.899999618530273,"d":"8.9"},61.5,{"v":2.5999999046325684,"d":"2.6"},0.43,0.19,{"v":0,"d":"0.00"},{"v":0.19,"d":"0.2"},0.14,0.96,{"v":13.891213389121338,"d":"13.89"},{"v":14.309623430962343,"d":"14.31"},{"v":0,"d":"0.00"},{"v":13.05439330543933,"d":"13.05"},3120,{"v":9.581589958158995,"d":"9.58"},2290,{"v":13.472803347280335,"d":"13.47"},3220,{"v":9.748953974895397,"d":"9.75"},2330,10,20,{"v":0,"d":"0.00"},{"v":0,"d":"0.00"},{"v":0,"d":"0.00"},{"v":0,"d":"0.00"},{"v":0,"d":"0.00"},{"v":0,"d":"0.00"},"Organic table  (ITAB &AFZ)"]
["Wheat 10,5% CP","Blé tendre 10,5% MAT","Cereals",86.9,10.9,2.4,1.4,1.5,0.31,{"v":0.32999999999999996,"d":"0.33"},0.18,{"v":0.42000000000000004,"d":"0.42"},0.13,0.25,1.8,{"v":0.08,"d":"0.1"},1.6,5.8,0.6,0.06,0.31,{"v":0.005,"d":"0.01"},{"v":2,"d":"2.0"},{"v":0.1,"d":"0.10"},{"v":0.4,"d":"0.40"},{"v":13.723849372384937,"d":"13.72"},{"v":14.01673640167364,"d":"14.02"},1.4,{"v":13.305439330543933,"d":"13.31"},3180,{"v":10.418410041841005,"d":"10.42"},2490,{"v":13.514644351464435,"d":"13.51"},3230,{"v":10.543933054393305,"d":"10.54"},2520,50,50,0.25,{"v":0.27999999999999997,"d":"0.28"},0.16,{"v":0.22000000000000003,"d":"0.22"},0.38,0.12,"Organic table  (ITAB &AFZ)"]
["Wheat 11,5% CP","Blé tendre 11,5% MAT","Cereals",86.9,11.5,2.4,1.4,1.5,{"v":0.33999999999999997,"d":"0.34"},0.36,{"v":0.2,"d":"0.20"},{"v":0.45999999999999996,"d":"0.46"},{"v":0.13999999999999999,"d":"0.14"},0.27,1.8,{"v":0.08,"d":"0.1"},1.6,5.8,0.6,0.06,0.31,{"v":0.005,"d":"0.01"},{"v":2,"d":"2.0"},{"v":0.1,"d":"0.10"},{"v":0.4,"d":"0.40"},{"v":13.891213389121338,"d":"13.89"},{"v":14.142259414225942,"d":"14.14"},1.4,{"v":13.472803347280335,"d":"13.47"},3220,{"v":10.460251046025105,"d":"10.46"},2500,{"v":13.640167364016737,"d":"13.64"},3260,{"v":10.543933054393305,"d":"10.54"},2520,50,50,0.25,{"v":0.27999999999999997,"d":"0.28"},0.16,{"v":0.22000000000000003,"d":"0.22"},0.38,0.12,"Organic table  (ITAB &AFZ)"]
["Wheat 9,5% CP","Blé tendre 9,5% MAT","Cereals",86.9,9.5,2.4,1.4,1.5,{"v":0.27999999999999997,"d":"0.28"},{"v":0.3,"d":"0.30"},0.16,0.38,0.12,{"v":0.22999999999999998,"d":"0.23"},1.8,{"v":0.08,"d":"0.1"},1.6,5.8,0.6,0.06,0.31,{"v":0.005,"d":"0.01"},{"v":2,"d":"2.0"},{"v":0.1,"d":"0.10"},{"v":0.4,"d":"0.40"},{"v":13.807531380753138,"d":"13.81"},{"v":14.518828451882845,"d":"14.52"},1.4,{"v":13.389121338912133,"d":"13.39"},3200,{"v":10.460251046025105,"d":"10.46"},2500,{"v":13.598326359832637,"d":"13.60"},3250,{"v":10.627615062761507,"d":"10.63"},2540,50,50,0.25,{"v":0.27999999999999997,"d":"0.28"},0.16,{"v":0.22000000000000003,"d":"0.22"},0.38,0.12,"Organic table  (ITAB &AFZ)"]
["Wheat bran",null,"Wheat by-products",87.5,10.5,{"v":2.5999999046325684,"d":"2.6"},{"v":1.600000023841858,"d":"1.6"},{"v":1.600000023841858,"d":"1.6"},{"v":0.3099999904632568,"d":"0.31"},{"v":0.3200000047683716,"d":"0.32"},{"v":0.17000000476837157,"d":"0.17"},{"v":0.40999999046325686,"d":"0.41"},{"v":0.12999999523162842,"d":"0.13"},{"v":0.24000000953674316,"d":"0.24"},{"v":17.799999237060547,"d":"17.8"},{"v":0.800000011920929,"d":"0.8"},{"v":15.199999809265137,"d":"15.2"},{"v":56.400001525878906,"d":"56.4"},{"v":5.900000095367432,"d":"5.9"},{"v":0.06000000238418579,"d":"0.06"},{"v":0.3200000047683716,"d":"0.32"},{"v":0.005000000074505806,"d":"0.01"},{"v":2.0999999046325684,"d":"2.1"},{"v":0.1,"d":"0.10"},{"v":0.4,"d":"0.40"},{"v":13.723849372384937,"d":"13.72"},{"v":14.01673640167364,"d":"14.02"},4.8,{"v":13.305439330543933,"d":"13.31"},3180,{"v":10.418410041841005,"d":"10.42"},2490,{"v":13.514644351464435,"d":"13.51"},3230,{"v":6.7,"d":"6.70"},1600,5,10,0.25,0.2700000047683716,0.15,0.2200000047683716,0.3700000047683716,0.1100000023841858,"Organic table  (ITAB &AFZ)"]
["Wheat middlings, all types except durum, organic",null,"Wheat by-products",{"v":86.5999984741211,"d":"86.6"},{"v":15.199999809265137,"d":"15.2"},{"v":6.599999904632568,"d":"6.6"},{"v":3.9000000953674316,"d":"3.9"},{"v":4.400000095367432,"d":"4.4"},{"v":0.6,"d":"0.60"},{"v":0.49000000953674316,"d":"0.49"},{"v":0.22999999523162842,"d":"0.23"},{"v":0.5400000095367432,"d":"0.54"},{"v":0.2,"d":"0.20"},{"v":0.3099999904632568,"d":"0.31"},{"v":17.799999237060547,"d":"17.8"},{"v":0.800000011920929,"d":"0.8"},{"v":15.199999809265137,"d":"15.2"},{"v":56.400001525878906,"d":"56.4"},{"v":5.900000095367432,"d":"5.9"},{"v":0.1100000023841858,"d":"0.11"},{"v":0.8800000190734864,"d":"0.88"},{"v":0.005000000074505806,"d":"0.01"},{"v":7,"d":"7.0"},0.35,{"v":1.0899999618530274,"d":"1.09"},{"v":11.213389121338912,"d":"11.21"},{"v":11.92468619246862,"d":"11.92"},{"v":0,"d":"0.00"},{"v":10.753138075313808,"d":"10.75"},2570,{"v":7.949790794979079,"d":"7.95"},1900,{"v":11.338912133891213,"d":"11.34"},2710,{"v":8.326359832635983,"d":"8.33"},1990,{"v":0,"d":"0.00"},{"v":0,"d":"0.00"},{"v":0.45999999046325685,"d":"0.46"},{"v":0.3599999904632568,"d":"0.36"},{"v":0.1899999976158142,"d":"0.19"},{"v":0.24000000953674316,"d":"0.24"},{"v":0.43000001907348634,"d":"0.43"},{"v":0.1600000023841858,"d":"0.16"},"Organic table  (ITAB &AFZ)"]
["Whey (liquid)",null,"9.Individual component with low DM",6.9,0.9,{"v":5,"d":"5.0"},{"v":0,"d":"0.00"},0.7,{"v":0,"d":"0.00"},{"v":0,"d":"0.00"},{"v":0,"d":"0.00"},{"v":0,"d":"0.00"},{"v":0,"d":"0.00"},{"v":0,"d":"0.00"},{"v":0,"d":"0.0"},{"v":0,"d":"0.0"},{"v":0,"d":"0.0"},{"v":0,"d":"0.0"},{"v":0,"d":"0.0"},{"v":0.005,"d":"0.01"},{"v":0,"d":"0.00"},{"v":0,"d":"0.00"},{"v":0,"d":"0.00"},{"v":0,"d":"0.00"},{"v":0,"d":"0.00"},{"v":0,"d":"0.00"},{"v":0,"d":"0.00"},{"v":0,"d":"0.00"},{"v":0,"d":"0.00"},{"v":0,"d":"0.00"},{"v":0,"d":"0.00"},{"v":0,"d":"0.00"},{"v":0,"d":"0.00"},{"v":0,"d":"0.00"},{"v":0,"d":"0.00"},{"v":0,"d":"0.00"},{"v":0,"d":"0.00"},{"v":0,"d":"0.00"},{"v":0,"d":"0.00"},{"v":0,"d":"0.00"},{"v":0,"d":"0.00"},{"v":0,"d":"0.00"},{"v":0,"d":"0.00"},{"v":0,"d":"0.00"},"DAVID J. SCHINGOETHE 1975"]
["Whey dreid (Full fat)",null,"Dairy productcts",96.2,13.3,{"v":0,"d":"0.0"},18.8,8.2,0.99,0.75,{"v":0.2,"d":"0.20"},{"v":0.44000000000000006,"d":"0.44"},0.19,0.24,52.4,22.9,38.8,7.2,1.8,{"v":0.8099999999999999,"d":"0.81"},{"v":0.7,"d":"0.70"},{"v":0.632,"d":"0.63"},{"v":0,"d":"0.00"},{"v":0,"d":"0.00"},2.06,{"v":18.410041841004183,"d":"18.41"},{"v":18.410041841004183,"d":"18.41"},6.3,{"v":17.90794979079498,"d":"17.91"},4280,{"v":14.435146443514645,"d":"14.44"},3450,{"v":17.86610878661088,"d":"17.87"},4270,{"v":14.393305439330543,"d":"14.39"},3440,4,15,0.88,0.64,0.19,0.21,{"v":0.4,"d":"0.40"},0.16,"INRA feed table 2002"]
["Whey dried (low fat)",null,"Dairy productcts",95.7,14.4,{"v":0,"d":"0.0"},9.9,8.5,{"v":1.0699999999999998,"d":"1.07"},0.82,{"v":0.22000000000000003,"d":"0.22"},0.48,{"v":0.2,"d":"0.20"},0.26,27.7,12.1,20.5,3.8,0.9,{"v":0.8800000000000001,"d":"0.88"},0.72,{"v":0.642,"d":"0.64"},{"v":0,"d":"0.00"},{"v":0,"d":"0.00"},2.07,{"v":16.485355648535563,"d":"16.49"},{"v":16.485355648535563,"d":"16.49"},6.5,{"v":15.98326359832636,"d":"15.98"},3820,{"v":12.594142259414227,"d":"12.59"},3010,{"v":15.94142259414226,"d":"15.94"},3810,{"v":12.552301255230125,"d":"12.55"},3000,4,15,0.95,{"v":0.7,"d":"0.70"},{"v":0.2,"d":"0.20"},0.23,"0..43",0.18,"INRA feed table 2002"]
["Whey, acid or sweet, dehydrated",null,"Dairy productcts",{"v":96.69999694824219,"d":"96.7"},{"v":11.800000190734863,"d":"11.8"},{"v":0,"d":"0.0"},2.5,{"v":8,"d":"8.0"},{"v":0.8800000190734864,"d":"0.88"},{"v":0.6599999904632569,"d":"0.66"},{"v":0.1799999952316284,"d":"0.18"},{"v":0.3900000095367432,"d":"0.39"},{"v":0.1600000023841858,"d":"0.16"},{"v":0.20999999046325685,"d":"0.21"},{"v":29.299999237060547,"d":"29.3"},{"v":12.800000190734863,"d":"12.8"},{"v":21.700000762939453,"d":"21.7"},{"v":4,"d":"4.0"},{"v":1,"d":"1.0"},{"v":0.7699999809265137,"d":"0.77"},{"v":0.6800000190734863,"d":"0.68"},{"v":0.6309999942779541,"d":"0.63"},{"v":0,"d":"0.0"},0.15,{"v":2.0700000762939452,"d":"2.07"},{"v":15.355648535564853,"d":"15.36"},{"v":15.355648535564853,"d":"15.36"},{"v":0,"d":"0.00"},{"v":14.895397489539748,"d":"14.90"},3560,{"v":11.757322175732218,"d":"11.76"},2810,{"v":14.853556485355648,"d":"14.85"},3550,{"v":11.715481171548117,"d":"11.72"},2800,4,15,{"v":0.7900000095367432,"d":"0.79"},{"v":0.5599999904632569,"d":"0.56"},{"v":0.1600000023841858,"d":"0.16"},{"v":0.1899999976158142,"d":"0.19"},0.35,{"v":0.13999999761581422,"d":"0.14"},"Organic table  (ITAB &AFZ)"]
["White Lupine",null,"Legume seeds",87.5,{"v":32.900001525878906,"d":"32.9"},{"v":11.800000190734863,"d":"11.8"},{"v":6.699999809265137,"d":"6.7"},{"v":3.4000000953674316,"d":"3.4"},{"v":1.6100000381469726,"d":"1.61"},{"v":1.2300000190734863,"d":"1.23"},{"v":0.25999999046325684,"d":"0.26"},{"v":0.8100000381469726,"d":"0.81"},{"v":0.22999999523162842,"d":"0.23"},0.55,{"v":7.400000095367432,"d":"7.4"},{"v":2,"d":"2.0"},{"v":49.099998474121094,"d":"49.1"},{"v":14.699999809265137,"d":"14.7"},{"v":8.300000190734863,"d":"8.3"},{"v":0.25999999046325684,"d":"0.26"},{"v":0.3599999904632568,"d":"0.36"},{"v":0.028999999999999998,"d":"0.03"},{"v":2.200000047683716,"d":"2.2"},{"v":0.13999999761581422,"d":"0.14"},0.97,{"v":14.560669456066945,"d":"14.56"},{"v":15.481171548117155,"d":"15.48"},{"v":1.7999999523162842,"d":"1.8"},{"v":13.556485355648535,"d":"13.56"},3240,{"v":8.870292887029288,"d":"8.87"},2120,{"v":14.225941422594142,"d":"14.23"},3400,{"v":9.456066945606695,"d":"9.46"},2260,5,10,{"v":1.3199999809265137,"d":"1.32"},{"v":0.9600000381469727,"d":"0.96"},{"v":0.2,"d":"0.20"},{"v":0.40999999046325686,"d":"0.41"},{"v":0.6099999904632568,"d":"0.61"},{"v":0,"d":"0.00"},"Organic table  (ITAB &AFZ)"]
["White Lupine leaves",null,"Forage ",20.2,21.5,23.5,3.1,{"v":8,"d":"8.0"},{"v":0,"d":"0.00"},{"v":0,"d":"0.00"},{"v":0,"d":"0.00"},{"v":0,"d":"0.00"},{"v":0,"d":"0.00"},{"v":0,"d":"0.00"},{"v":0,"d":"0.00"},{"v":0,"d":"0.00"},{"v":0,"d":"0.00"},{"v":0,"d":"0.00"},{"v":0,"d":"0.00"},1.27,0.26,{"v":0,"d":"0.00"},{"v":0,"d":"0.00"},{"v":0,"d":"0.00"},{"v":0,"d":"0.00"},{"v":0,"d":"0.00"},{"v":0,"d":"0.00"},{"v":0,"d":"0.00"},{"v":0,"d":"0.00"},{"v":0,"d":"0.00"},{"v":0,"d":"0.00"},{"v":0,"d":"0.00"},{"v":0,"d":"0.00"},{"v":0,"d":"0.00"},{"v":0,"d":"0.00"},{"v":0,"d":"0.00"},10,15,{"v":0,"d":"0.00"},{"v":0,"d":"0.00"},{"v":0,"d":"0.00"},{"v":0,"d":"0.00"},{"v":0,"d":"0.00"},{"v":0,"d":"0.00"},"Feedipedia "]
["Yeast dried",null,"Other plant product ",93.3,46.5,1.8,3.6,7.1,{"v":0.6900000000000001,"d":"0.69"},0.39,0.15,0.48,{"v":0.049,"d":"0.05"},{"v":0.32999999999999996,"d":"0.33"},{"v":0,"d":"0.00"},{"v":0,"d":"0.00"},{"v":0,"d":"0.00"},{"v":0,"d":"0.00"},{"v":0,"d":"0.00"},0.03,1.31,0.18,{"v":0,"d":"0.00"},0.24,{"v":0,"d":"0.00"},{"v":17.11297071129707,"d":"17.11"},{"v":0,"d":"0.00"},{"v":0,"d":"0.00"},{"v":14.518828451882845,"d":"14.52"},3470,{"v":10.418410041841005,"d":"10.42"},2490,{"v":0,"d":"0.00"},{"v":0,"d":"0.00"},{"v":0,"d":"0.00"},{"v":0,"d":"0.00"},5,10,{"v":0,"d":"0.00"},{"v":0,"d":"0.00"},{"v":0,"d":"0.00"},{"v":0,"d":"0.00"},{"v":0,"d":"0.00"},{"v":0,"d":"0.00"},"French table and Feedipedia"]

{"sheet":"Swine_needs","index":3,"n_rows":100,"n_cols":46,"rows_kept":100}
["Obj_reference","Scénarios","Swine requiment ","Type of animals to select inclusing levels","Weight/Age","ME objective (MJ or g/kg)","ME Max ","NE objective (MJ or g/kg)","NE max","CP min","Cp max","Fiber Min ","Fiber max","Fat min","Fat Max","Ca min","Ca max","P min","P max ","P avail","Na min","Na max","Tot Lys min","Tot Lys max","Lys Dig min","Lys Dig max","Met tot min","met tot max","Met Dig min","Met Dig Max","TRY tot min","Try tot max","Try Dig min","Try Dig max","Met+Cys tot min","Met+Cys tot max","Met+Cys Dig min","Met+Cys Dig Max","Thr tot min","Thr tot max","Thr Dig min","Thr Dig max","ME growing pigs min","ME growing pigs max","NE growing pigs min","NE growing pigs max"]
[{"$f":"B2&\"_\"&C2","v":"Pigs_2_Phasis_Grower"},"Pigs_2_Phasis","Grower","Pigs and sows","35 - 70 kg",12.4,{"v":13.899999999999999,"d":"13.9"},{"v":9,"d":"9.0"},10.5,{"v":17,"d":"17.0"},18.5,{"v":2,"d":"2.0"},3.5,{"v":1,"d":"1.0"},2.5,{"v":6,"d":"6.0"},7.5,{"v":4,"d":"4.0"},5.5,2.3,0.5,{"v":2,"d":"2.0"},{"v":9,"d":"9.0"},10.5,{"v":7.6499999999999995,"d":"7.7"},{"v":8.924999999999999,"d":"8.9"},{"v":2.6999999999999997,"d":"2.7"},{"v":3.15,"d":"3.2"},{"v":2.295,"d":"2.3"},{"v":2.6774999999999998,"d":"2.7"},{"v":1.71,"d":"1.7"},{"v":1.995,"d":"2.0"},{"v":1.4535,"d":"1.5"},{"v":1.6957499999999999,"d":"1.7"},{"v":5.8500000000000005,"d":"5.9"},{"v":6.825,"d":"6.8"},{"v":4.9725,"d":"5.0"},{"v":5.80125,"d":"5.8"},{"v":6.57,"d":"6.6"},{"v":7.665,"d":"7.7"},{"v":5.584499999999999,"d":"5.6"},{"v":6.515249999999999,"d":"6.5"},{"v":0,"d":"0.0"},{"v":100,"d":"100.0"},{"v":0,"d":"0.0"},{"v":100,"d":"100.0"}]
["Pigs_2_Phasis_Weaners","Pigs_2_Phasis","Weaners","Piglets","< 35 kg",12.4,{"v":13.899999999999999,"d":"13.9"},{"v":9,"d":"9.0"},10.5,{"v":15,"d":"15.0"},16.5,{"v":4,"d":"4.0"},5.5,{"v":3,"d":"3.0"},4.5,{"v":5,"d":"5.0"},6.5,{"v":4,"d":"4.0"},5.5,3.2,1.5,{"v":3,"d":"3.0"},{"v":10,"d":"10.0"},11.5,8.5,{"v":9.775,"d":"9.8"},{"v":3,"d":"3.0"},{"v":3.4499999999999997,"d":"3.5"},{"v":2.55,"d":"2.6"},{"v":2.9325,"d":"2.9"},1.9,{"v":2.185,"d":"2.2"},{"v":1.615,"d":"1.6"},{"v":1.85725,"d":"1.9"},6.5,{"v":7.4750000000000005,"d":"7.5"},{"v":5.525,"d":"5.5"},{"v":6.353750000000001,"d":"6.4"},7.3,{"v":8.395,"d":"8.4"},{"v":6.205,"d":"6.2"},{"v":7.13575,"d":"7.1"},{"v":0,"d":"0.0"},{"v":100,"d":"100.0"},{"v":0,"d":"0.0"},{"v":100,"d":"100.0"}]
["Pigs_3_Phasis_Weaners","Pigs_3_Phasis","Weaners","Piglets","< 35 kg",{"v":12,"d":"12.0"},13.5,9.5,{"v":11,"d":"11.0"},{"v":17,"d":"17.0"},18.5,{"v":2,"d":"2.0"},3.5,{"v":3,"d":"3.0"},4.5,{"v":6,"d":"6.0"},7.5,{"v":5,"d":"5.0"},6.5,3.2,0.5,{"v":2,"d":"2.0"},{"v":11,"d":"11.0"},12.5,{"v":9.35,"d":"9.4"},{"v":10.625,"d":"10.6"},3.3,{"v":3.75,"d":"3.8"},{"v":2.8049999999999997,"d":"2.8"},{"v":3.1875,"d":"3.2"},{"v":2.09,"d":"2.1"},{"v":2.375,"d":"2.4"},{"v":1.7765,"d":"1.8"},{"v":2.01875,"d":"2.0"},{"v":7.15,"d":"7.2"},{"v":8.125,"d":"8.1"},{"v":6.0775,"d":"6.1"},{"v":6.90625,"d":"6.9"},{"v":8.03,"d":"8.0"},{"v":9.125,"d":"9.1"},{"v":6.8255,"d":"6.8"},{"v":7.75625,"d":"7.8"},{"v":0,"d":"0.0"},{"v":100,"d":"100.0"},{"v":0,"d":"0.0"},{"v":100,"d":"100.0"}]
["Pigs_3_Phasis_Grower","Pigs_3_Phasis","Grower","Pigs and sows","35 - 70 kg",12.4,{"v":13.899999999999999,"d":"13.9"},{"v":9,"d":"9.0"},10.5,{"v":17,"d":"17.0"},18.5,{"v":2,"d":"2.0"},3.5,{"v":1,"d":"1.0"},2.5,{"v":6,"d":"6.0"},7.5,{"v":4,"d":"4.0"},5.5,2.3,0.5,{"v":2,"d":"2.0"},{"v":9,"d":"9.0"},10.5,{"v":7.6499999999999995,"d":"7.7"},{"v":8.924999999999999,"d":"8.9"},{"v":2.6999999999999997,"d":"2.7"},{"v":3.15,"d":"3.2"},{"v":2.295,"d":"2.3"},{"v":2.6774999999999998,"d":"2.7"},{"v":1.71,"d":"1.7"},{"v":1.995,"d":"2.0"},{"v":1.4535,"d":"1.5"},{"v":1.6957499999999999,"d":"1.7"},{"v":5.8500000000000005,"d":"5.9"},{"v":6.825,"d":"6.8"},{"v":4.9725,"d":"5.0"},{"v":5.80125,"d":"5.8"},{"v":6.57,"d":"6.6"},{"v":7.665,"d":"7.7"},{"v":5.584499999999999,"d":"5.6"},{"v":6.515249999999999,"d":"6.5"},{"v":0,"d":"0.0"},{"v":100,"d":"100.0"},{"v":0,"d":"0.0"},{"v":100,"d":"100.0"}]
["Pigs_3_Phasis_Finisher","Pigs_3_Phasis","Finisher","Pigs and sows","> 75 kg",11.6,13.1,8.5,{"v":10,"d":"10.0"},{"v":13,"d":"13.0"},14.5,{"v":3,"d":"3.0"},4.5,{"v":1,"d":"1.0"},2.5,{"v":4,"d":"4.0"},5.5,{"v":3,"d":"3.0"},4.5,1.7,{"v":0,"d":"0.0"},1.5,6.5,{"v":8,"d":"8.0"},{"v":5.5249999999999995,"d":"5.5"},6.8,{"v":1.95,"d":"2.0"},2.4,{"v":1.6574999999999998,"d":"1.7"},{"v":2.04,"d":"2.0"},{"v":1.235,"d":"1.2"},{"v":1.52,"d":"1.5"},{"v":1.04975,"d":"1.0"},{"v":1.292,"d":"1.3"},{"v":4.2250000000000005,"d":"4.2"},5.2,{"v":3.5912499999999996,"d":"3.6"},{"v":4.42,"d":"4.4"},{"v":4.745,"d":"4.7"},{"v":5.84,"d":"5.8"},{"v":4.03325,"d":"4.0"},{"v":4.9639999999999995,"d":"5.0"},{"v":0,"d":"0.0"},{"v":100,"d":"100.0"},{"v":0,"d":"0.0"},{"v":100,"d":"100.0"}]
["Pigs_Fatteners_3_Phasis_Grower_1","Pigs_Fatteners_3_Phasis","Grower_1","Pigs and sows","35 - 50 kg",12.4,{"v":13.899999999999999,"d":"13.9"},{"v":9,"d":"9.0"},10.5,{"v":17,"d":"17.0"},18.5,{"v":2,"d":"2.0"},3.5,{"v":1,"d":"1.0"},2.5,{"v":6,"d":"6.0"},7.5,{"v":4,"d":"4.0"},5.5,2.3,0.5,{"v":2,"d":"2.0"},{"v":9,"d":"9.0"},10.5,{"v":7.6499999999999995,"d":"7.7"},{"v":8.924999999999999,"d":"8.9"},{"v":2.6999999999999997,"d":"2.7"},{"v":3.15,"d":"3.2"},{"v":2.295,"d":"2.3"},{"v":2.6774999999999998,"d":"2.7"},{"v":1.71,"d":"1.7"},{"v":1.995,"d":"2.0"},{"v":1.4535,"d":"1.5"},{"v":1.6957499999999999,"d":"1.7"},{"v":5.8500000000000005,"d":"5.9"},{"v":6.825,"d":"6.8"},{"v":4.9725,"d":"5.0"},{"v":5.80125,"d":"5.8"},{"v":6.57,"d":"6.6"},{"v":7.665,"d":"7.7"},{"v":5.584499999999999,"d":"5.6"},{"v":6.515249999999999,"d":"6.5"},{"v":0,"d":"0.0"},{"v":100,"d":"100.0"},{"v":0,"d":"0.0"},{"v":100,"d":"100.0"}]
["Pigs_Fatteners_3_Phasis_Grower_2","Pigs_Fatteners_3_Phasis","Grower_2","Pigs and sows","50 - 75 kg",{"v":12,"d":"12.0"},13.5,8.5,{"v":10,"d":"10.0"},{"v":15,"d":"15.0"},16.5,{"v":2,"d":"2.0"},3.5,{"v":1,"d":"1.0"},2.5,{"v":5,"d":"5.0"},6.5,3.5,{"v":5,"d":"5.0"},1.9,0.5,{"v":2,"d":"2.0"},{"v":8,"d":"8.0"},9.5,6.8,{"v":8.075,"d":"8.1"},2.4,{"v":2.85,"d":"2.9"},{"v":2.04,"d":"2.0"},{"v":2.4225,"d":"2.4"},{"v":1.52,"d":"1.5"},{"v":1.805,"d":"1.8"},{"v":1.292,"d":"1.3"},{"v":1.53425,"d":"1.5"},5.2,{"v":6.175,"d":"6.2"},{"v":4.42,"d":"4.4"},{"v":5.248749999999999,"d":"5.2"},{"v":5.84,"d":"5.8"},{"v":6.935,"d":"6.9"},{"v":4.9639999999999995,"d":"5.0"},{"v":5.894749999999999,"d":"5.9"},{"v":0,"d":"0.0"},{"v":100,"d":"100.0"},{"v":0,"d":"0.0"},{"v":100,"d":"100.0"}]
["Pigs_Fatteners_3_Phasis_Finisher","Pigs_Fatteners_3_Phasis","Finisher","Pigs and sows","> 75 kg",11.6,13.1,8.5,{"v":10,"d":"10.0"},{"v":13,"d":"13.0"},14.5,{"v":3,"d":"3.0"},4.5,{"v":1,"d":"1.0"},2.5,{"v":4,"d":"4.0"},5.5,{"v":3,"d":"3.0"},4.5,1.7,{"v":0,"d":"0.0"},1.5,6.5,{"v":8,"d":"8.0"},{"v":5.5249999999999995,"d":"5.5"},6.8,{"v":1.95,"d":"2.0"},2.4,{"v":1.6574999999999998,"d":"1.7"},{"v":2.04,"d":"2.0"},{"v":1.235,"d":"1.2"},{"v":1.52,"d":"1.5"},{"v":1.04975,"d":"1.0"},{"v":1.292,"d":"1.3"},{"v":4.2250000000000005,"d":"4.2"},5.2,{"v":3.5912499999999996,"d":"3.6"},{"v":4.42,"d":"4.4"},{"v":4.745,"d":"4.7"},{"v":5.84,"d":"5.8"},{"v":4.03325,"d":"4.0"},{"v":4.9639999999999995,"d":"5.0"},{"v":0,"d":"0.0"},{"v":100,"d":"100.0"},{"v":0,"d":"0.0"},{"v":100,"d":"100.0"}]
["Multi-Phasis_Weaners","Multi-Phasis","Weaners","Piglets","< 35 kg",12.4,{"v":13.899999999999999,"d":"13.9"},{"v":9,"d":"9.0"},10.5,{"v":15,"d":"15.0"},16.5,{"v":4,"d":"4.0"},5.5,{"v":3,"d":"3.0"},4.5,{"v":5,"d":"5.0"},6.5,{"v":4,"d":"4.0"},5.5,3.2,1.5,{"v":3,"d":"3.0"},{"v":10,"d":"10.0"},11.5,8.5,{"v":9.775,"d":"9.8"},{"v":3,"d":"3.0"},{"v":3.4499999999999997,"d":"3.5"},{"v":2.55,"d":"2.6"},{"v":2.9325,"d":"2.9"},1.9,{"v":2.185,"d":"2.2"},{"v":1.615,"d":"1.6"},{"v":1.85725,"d":"1.9"},6.5,{"v":7.4750000000000005,"d":"7.5"},{"v":5.525,"d":"5.5"},{"v":6.353750000000001,"d":"6.4"},7.3,{"v":8.395,"d":"8.4"},{"v":6.205,"d":"6.2"},{"v":7.13575,"d":"7.1"},{"v":0,"d":"0.0"},{"v":100,"d":"100.0"},{"v":0,"d":"0.0"},{"v":100,"d":"100.0"}]
["Multi-Phasis_Piglets","Multi-Phasis","Piglets","Piglets ","< 35 kg",{"v":12,"d":"12.0"},13.5,9.5,{"v":11,"d":"11.0"},{"v":17,"d":"17.0"},18.5,{"v":2,"d":"2.0"},3.5,{"v":3,"d":"3.0"},4.5,{"v":6,"d":"6.0"},7.5,{"v":5,"d":"5.0"},6.5,3.2,0.5,{"v":2,"d":"2.0"},{"v":11,"d":"11.0"},10.5,{"v":9.35,"d":"9.4"},{"v":8.924999999999999,"d":"8.9"},3.3,{"v":3.15,"d":"3.2"},{"v":2.8049999999999997,"d":"2.8"},{"v":2.6774999999999998,"d":"2.7"},{"v":2.09,"d":"2.1"},{"v":1.995,"d":"2.0"},{"v":1.7765,"d":"1.8"},{"v":1.6957499999999999,"d":"1.7"},{"v":7.15,"d":"7.2"},{"v":6.825,"d":"6.8"},{"v":6.0775,"d":"6.1"},{"v":5.80125,"d":"5.8"},{"v":8.03,"d":"8.0"},{"v":7.665,"d":"7.7"},{"v":6.8255,"d":"6.8"},{"v":6.515249999999999,"d":"6.5"},{"v":0,"d":"0.0"},{"v":100,"d":"100.0"},{"v":0,"d":"0.0"},{"v":100,"d":"100.0"}]
["Multi-Phasis_Grower_1","Multi-Phasis","Grower_1","Pigs and sows","35 - 50 kg",12.4,{"v":13.899999999999999,"d":"13.9"},{"v":9,"d":"9.0"},10.5,{"v":17,"d":"17.0"},18.5,{"v":2,"d":"2.0"},3.5,{"v":1,"d":"1.0"},2.5,{"v":6,"d":"6.0"},7.5,{"v":4,"d":"4.0"},5.5,2.3,0.5,{"v":2,"d":"2.0"},{"v":9,"d":"9.0"},10.5,{"v":7.6499999999999995,"d":"7.7"},{"v":8.924999999999999,"d":"8.9"},{"v":2.6999999999999997,"d":"2.7"},{"v":3.15,"d":"3.2"},{"v":2.295,"d":"2.3"},{"v":2.6774999999999998,"d":"2.7"},{"v":1.71,"d":"1.7"},{"v":1.995,"d":"2.0"},{"v":1.4535,"d":"1.5"},{"v":1.6957499999999999,"d":"1.7"},{"v":5.8500000000000005,"d":"5.9"},{"v":6.825,"d":"6.8"},{"v":4.9725,"d":"5.0"},{"v":5.80125,"d":"5.8"},{"v":6.57,"d":"6.6"},{"v":7.665,"d":"7.7"},{"v":5.584499999999999,"d":"5.6"},{"v":6.515249999999999,"d":"6.5"},{"v":0,"d":"0.0"},{"v":100,"d":"100.0"},{"v":0,"d":"0.0"},{"v":100,"d":"100.0"}]
["Multi-Phasis_Grower_2","Multi-Phasis","Grower_2","Pigs and sows","50 - 75 kg",{"v":12,"d":"12.0"},13.5,8.5,{"v":10,"d":"10.0"},{"v":15,"d":"15.0"},16.5,{"v":2,"d":"2.0"},3.5,{"v":1,"d":"1.0"},2.5,{"v":5,"d":"5.0"},6.5,3.5,{"v":5,"d":"5.0"},1.9,0.5,{"v":2,"d":"2.0"},{"v":8,"d":"8.0"},9.5,6.8,{"v":8.075,"d":"8.1"},2.4,{"v":2.85,"d":"2.9"},{"v":2.04,"d":"2.0"},{"v":2.4225,"d":"2.4"},{"v":1.52,"d":"1.5"},{"v":1.805,"d":"1.8"},{"v":1.292,"d":"1.3"},{"v":1.53425,"d":"1.5"},5.2,{"v":6.175,"d":"6.2"},{"v":4.42,"d":"4.4"},{"v":5.248749999999999,"d":"5.2"},{"v":5.84,"d":"5.8"},{"v":6.935,"d":"6.9"},{"v":4.9639999999999995,"d":"5.0"},{"v":5.894749999999999,"d":"5.9"},{"v":0,"d":"0.0"},{"v":100,"d":"100.0"},{"v":0,"d":"0.0"},{"v":100,"d":"100.0"}]
["Multi-Phasis_Finisher","Multi-Phasis","Finisher","Pigs and sows","> 75 kg",11.6,13.1,8.5,{"v":10,"d":"10.0"},{"v":13,"d":"13.0"},14.5,{"v":3,"d":"3.0"},4.5,{"v":1,"d":"1.0"},2.5,{"v":4,"d":"4.0"},5.5,{"v":3,"d":"3.0"},4.5,1.7,{"v":0,"d":"0.0"},1.5,6.5,{"v":8,"d":"8.0"},{"v":5.5249999999999995,"d":"5.5"},6.8,{"v":1.95,"d":"2.0"},2.4,{"v":1.6574999999999998,"d":"1.7"},{"v":2.04,"d":"2.0"},{"v":1.235,"d":"1.2"},{"v":1.52,"d":"1.5"},{"v":1.04975,"d":"1.0"},{"v":1.292,"d":"1.3"},{"v":4.2250000000000005,"d":"4.2"},5.2,{"v":3.5912499999999996,"d":"3.6"},{"v":4.42,"d":"4.4"},{"v":4.745,"d":"4.7"},{"v":5.84,"d":"5.8"},{"v":4.03325,"d":"4.0"},{"v":4.9639999999999995,"d":"5.0"},{"v":0,"d":"0.0"},{"v":100,"d":"100.0"},{"v":0,"d":"0.0"},{"v":100,"d":"100.0"}]
["Single_Feeding_Grower","Single_Feeding","Grower","Pigs and sows","> 30 Kg",12.4,{"v":13.899999999999999,"d":"13.9"},{"v":9,"d":"9.0"},10.5,{"v":17,"d":"17.0"},18.5,{"v":2,"d":"2.0"},3.5,{"v":1,"d":"1.0"},2.5,{"v":6,"d":"6.0"},7.5,{"v":4,"d":"4.0"},5.5,2.3,0.5,{"v":2,"d":"2.0"},{"v":9,"d":"9.0"},10.5,{"v":7.6499999999999995,"d":"7.7"},{"v":8.924999999999999,"d":"8.9"},{"v":2.6999999999999997,"d":"2.7"},{"v":3.15,"d":"3.2"},{"v":2.295,"d":"2.3"},{"v":2.6774999999999998,"d":"2.7"},{"v":1.71,"d":"1.7"},{"v":1.995,"d":"2.0"},{"v":1.4535,"d":"1.5"},{"v":1.6957499999999999,"d":"1.7"},{"v":5.8500000000000005,"d":"5.9"},{"v":6.825,"d":"6.8"},{"v":4.9725,"d":"5.0"},{"v":5.80125,"d":"5.8"},{"v":6.57,"d":"6.6"},{"v":7.665,"d":"7.7"},{"v":5.584499999999999,"d":"5.6"},{"v":6.515249999999999,"d":"6.5"},{"v":0,"d":"0.0"},{"v":100,"d":"100.0"},{"v":0,"d":"0.0"},{"v":100,"d":"100.0"}]
["Single_Feeding_Piglets","Single_Feeding","Piglets","Piglets","< 35 kg",{"v":12,"d":"12.0"},13.5,9.5,{"v":11,"d":"11.0"},{"v":17,"d":"17.0"},18.5,{"v":2,"d":"2.0"},3.5,{"v":3,"d":"3.0"},4.5,{"v":6,"d":"6.0"},7.5,{"v":5,"d":"5.0"},6.5,3.2,0.5,{"v":2,"d":"2.0"},{"v":11,"d":"11.0"},12.5,{"v":9.35,"d":"9.4"},{"v":10.625,"d":"10.6"},3.3,{"v":3.75,"d":"3.8"},{"v":2.8049999999999997,"d":"2.8"},{"v":3.1875,"d":"3.2"},{"v":2.09,"d":"2.1"},{"v":2.375,"d":"2.4"},{"v":1.7765,"d":"1.8"},{"v":2.01875,"d":"2.0"},{"v":7.15,"d":"7.2"},{"v":8.125,"d":"8.1"},{"v":6.0775,"d":"6.1"},{"v":6.90625,"d":"6.9"},{"v":8.03,"d":"8.0"},{"v":9.125,"d":"9.1"},{"v":6.8255,"d":"6.8"},{"v":7.75625,"d":"7.8"},{"v":0,"d":"0.0"},{"v":100,"d":"100.0"},{"v":0,"d":"0.0"},{"v":100,"d":"100.0"}]
["Single_Feeding_Weaners","Single_Feeding","Weaners","Piglets","< 35 kg",12.4,{"v":13.899999999999999,"d":"13.9"},{"v":9,"d":"9.0"},10.5,{"v":15,"d":"15.0"},16.5,{"v":4,"d":"4.0"},5.5,{"v":3,"d":"3.0"},4.5,{"v":5,"d":"5.0"},6.5,{"v":4,"d":"4.0"},5.5,3.2,1.5,{"v":3,"d":"3.0"},{"v":10,"d":"10.0"},14.5,8.5,{"v":12.325,"d":"12.3"},{"v":3,"d":"3.0"},{"v":4.35,"d":"4.4"},{"v":2.55,"d":"2.6"},{"v":3.6975,"d":"3.7"},1.9,{"v":2.755,"d":"2.8"},{"v":1.615,"d":"1.6"},{"v":2.3417499999999998,"d":"2.3"},6.5,{"v":9.425,"d":"9.4"},{"v":5.525,"d":"5.5"},{"v":8.01125,"d":"8.0"},7.3,{"v":10.584999999999999,"d":"10.6"},{"v":6.205,"d":"6.2"},{"v":8.99725,"d":"9.0"},{"v":0,"d":"0.0"},{"v":100,"d":"100.0"},{"v":0,"d":"0.0"},{"v":100,"d":"100.0"}]
["Sow_Single_Feeding_Lactation","Sow_Single_Feeding","Lactation","Pigs and sows","lactation",12.2,13.7,8.5,{"v":10,"d":"10.0"},17.5,{"v":19,"d":"19.0"},2.5,{"v":4,"d":"4.0"},{"v":4,"d":"4.0"},{"v":6,"d":"6.0"},{"v":7,"d":"7.0"},8.5,5.5,{"v":7,"d":"7.0"},3.5,{"v":1,"d":"1.0"},2.5,{"v":8,"d":"8.0"},9.5,6.8,{"v":8.075,"d":"8.1"},2.4,{"v":2.85,"d":"2.9"},{"v":2.04,"d":"2.0"},{"v":2.4225,"d":"2.4"},{"v":1.52,"d":"1.5"},{"v":1.805,"d":"1.8"},{"v":1.292,"d":"1.3"},{"v":1.53425,"d":"1.5"},5.2,{"v":6.175,"d":"6.2"},{"v":4.42,"d":"4.4"},{"v":5.248749999999999,"d":"5.2"},{"v":5.84,"d":"5.8"},{"v":6.935,"d":"6.9"},{"v":4.9639999999999995,"d":"5.0"},{"v":5.894749999999999,"d":"5.9"},{"v":0,"d":"0.0"},{"v":100,"d":"100.0"},{"v":0,"d":"0.0"},{"v":100,"d":"100.0"}]
["Sows_2_Phasis_Gestation","Sows_2_Phasis","Gestation","Pigs and sows","gestation",{"v":11,"d":"11.0"},12.5,8.1,9.6,{"v":12,"d":"12.0"},13.5,{"v":7,"d":"7.0"},8.5,{"v":1,"d":"1.0"},2.5,{"v":5,"d":"5.0"},6.5,{"v":3,"d":"3.0"},4.5,1.7,{"v":1,"d":"1.0"},2.5,{"v":5,"d":"5.0"},6.5,{"v":4.25,"d":"4.3"},{"v":5.5249999999999995,"d":"5.5"},1.5,{"v":1.95,"d":"2.0"},{"v":1.275,"d":"1.3"},{"v":1.6574999999999998,"d":"1.7"},{"v":0.95,"d":"1.0"},{"v":1.235,"d":"1.2"},{"v":0.8075,"d":"0.8"},{"v":1.04975,"d":"1.0"},{"v":3.25,"d":"3.3"},{"v":4.2250000000000005,"d":"4.2"},{"v":2.7625,"d":"2.8"},{"v":3.5912499999999996,"d":"3.6"},{"v":3.65,"d":"3.7"},{"v":4.745,"d":"4.7"},{"v":3.1025,"d":"3.1"},{"v":4.03325,"d":"4.0"},{"v":0,"d":"0.0"},{"v":100,"d":"100.0"},{"v":0,"d":"0.0"},{"v":100,"d":"100.0"}]
["Sows_2_Phasis_Lactation","Sows_2_Phasis","Lactation","Pigs and sows","lactation",12.2,13.7,8.5,{"v":12.45,"d":"12.5"},17.5,{"v":21.45,"d":"21.5"},2.5,{"v":6.45,"d":"6.5"},{"v":4,"d":"4.0"},{"v":7.45,"d":"7.5"},{"v":7,"d":"7.0"},{"v":10.45,"d":"10.5"},5.5,{"v":9.45,"d":"9.5"},3.5,{"v":1,"d":"1.0"},{"v":4.45,"d":"4.5"},{"v":8,"d":"8.0"},{"v":12.45,"d":"12.5"},6.8,{"v":10.5825,"d":"10.6"},2.4,{"v":3.7349999999999994,"d":"3.7"},{"v":2.04,"d":"2.0"},{"v":3.17475,"d":"3.2"},{"v":1.52,"d":"1.5"},{"v":2.3655,"d":"2.4"},{"v":1.292,"d":"1.3"},{"v":2.010675,"d":"2.0"},5.2,{"v":8.0925,"d":"8.1"},{"v":4.42,"d":"4.4"},{"v":6.8786249999999995,"d":"6.9"},{"v":5.84,"d":"5.8"},{"v":9.0885,"d":"9.1"},{"v":4.9639999999999995,"d":"5.0"},{"v":7.725224999999999,"d":"7.7"},{"v":0,"d":"0.0"},{"v":100,"d":"100.0"},{"v":0,"d":"0.0"},{"v":100,"d":"100.0"}]
["Sows_4_Phasis_Early gestation","Sows_4_Phasis","Early gestation","Pigs and sows","< 3 weeks until farrowing",{"v":11,"d":"11.0"},12.5,8.1,9.6,{"v":12,"d":"12.0"},13.5,{"v":7,"d":"7.0"},8.5,{"v":1,"d":"1.0"},2.5,{"v":5,"d":"5.0"},6.5,{"v":3,"d":"3.0"},4.5,1.7,{"v":1,"d":"1.0"},2.5,{"v":5,"d":"5.0"},6.5,{"v":4.25,"d":"4.3"},{"v":5.5249999999999995,"d":"5.5"},1.5,{"v":1.95,"d":"2.0"},{"v":1.275,"d":"1.3"},{"v":1.6574999999999998,"d":"1.7"},{"v":0.95,"d":"1.0"},{"v":1.235,"d":"1.2"},{"v":0.8075,"d":"0.8"},{"v":1.04975,"d":"1.0"},{"v":3.25,"d":"3.3"},{"v":4.2250000000000005,"d":"4.2"},{"v":2.7625,"d":"2.8"},{"v":3.5912499999999996,"d":"3.6"},{"v":3.65,"d":"3.7"},{"v":4.745,"d":"4.7"},{"v":3.1025,"d":"3.1"},{"v":4.03325,"d":"4.0"},{"v":0,"d":"0.0"},{"v":100,"d":"100.0"},{"v":0,"d":"0.0"},{"v":100,"d":"100.0"}]
["Sows_4_Phasis_Late gestation","Sows_4_Phasis","Late gestation","Pigs and sows","> 3 weeks until farrowing",{"v":11,"d":"11.0"},12.5,8.1,{"v":11.45,"d":"11.5"},{"v":12,"d":"12.0"},{"v":15.45,"d":"15.5"},{"v":7,"d":"7.0"},{"v":10.45,"d":"10.5"},{"v":1,"d":"1.0"},{"v":4.45,"d":"4.5"},{"v":5,"d":"5.0"},{"v":8.45,"d":"8.5"},3.5,{"v":7.45,"d":"7.5"},1.9,{"v":1,"d":"1.0"},{"v":4.45,"d":"4.5"},{"v":5,"d":"5.0"},{"v":9.45,"d":"9.5"},{"v":4.25,"d":"4.3"},{"v":8.032499999999999,"d":"8.0"},1.5,{"v":2.8349999999999995,"d":"2.8"},{"v":1.275,"d":"1.3"},{"v":2.4097499999999994,"d":"2.4"},{"v":0.95,"d":"1.0"},{"v":1.7954999999999999,"d":"1.8"},{"v":0.8075,"d":"0.8"},{"v":1.5261749999999998,"d":"1.5"},{"v":3.25,"d":"3.3"},{"v":6.1425,"d":"6.1"},{"v":2.7625,"d":"2.8"},{"v":5.221125,"d":"5.2"},{"v":3.65,"d":"3.7"},{"v":6.898499999999999,"d":"6.9"},{"v":3.1025,"d":"3.1"},{"v":5.863724999999999,"d":"5.9"},{"v":0,"d":"0.0"},{"v":100,"d":"100.0"},{"v":0,"d":"0.0"},{"v":100,"d":"100.0"}]
["Sows_4_Phasis_Early lactation","Sows_4_Phasis","Early lactation","Pigs and sows","< 3 weeks",11.8,{"v":13.299999999999999,"d":"13.3"},8.5,{"v":10,"d":"10.0"},16.5,{"v":18,"d":"18.0"},{"v":3,"d":"3.0"},4.5,{"v":4,"d":"4.0"},5.5,6.5,{"v":8,"d":"8.0"},{"v":5,"d":"5.0"},6.5,3.5,{"v":1,"d":"1.0"},2.5,7.5,{"v":9,"d":"9.0"},{"v":6.375,"d":"6.4"},{"v":7.6499999999999995,"d":"7.7"},{"v":2.25,"d":"2.3"},{"v":2.6999999999999997,"d":"2.7"},{"v":1.9124999999999999,"d":"1.9"},{"v":2.295,"d":"2.3"},{"v":1.425,"d":"1.4"},{"v":1.71,"d":"1.7"},{"v":1.21125,"d":"1.2"},{"v":1.4535,"d":"1.5"},{"v":4.875,"d":"4.9"},{"v":5.8500000000000005,"d":"5.9"},{"v":4.14375,"d":"4.1"},{"v":4.9725,"d":"5.0"},{"v":5.475,"d":"5.5"},{"v":6.57,"d":"6.6"},{"v":4.65375,"d":"4.7"},{"v":5.584499999999999,"d":"5.6"},{"v":0,"d":"0.0"},{"v":100,"d":"100.0"},{"v":0,"d":"0.0"},{"v":100,"d":"100.0"}]
["Sows_4_Phasis_Late lactation","Sows_4_Phasis","Late lactation","Pigs and sows","> 3 weeks",12.2,13.7,8.5,{"v":12.45,"d":"12.5"},17.5,{"v":21.45,"d":"21.5"},2.5,{"v":6.45,"d":"6.5"},{"v":4,"d":"4.0"},{"v":7.45,"d":"7.5"},{"v":7,"d":"7.0"},{"v":10.45,"d":"10.5"},5.5,{"v":9.45,"d":"9.5"},3.5,{"v":1,"d":"1.0"},{"v":4.45,"d":"4.5"},{"v":8,"d":"8.0"},{"v":12.45,"d":"12.5"},6.8,{"v":10.5825,"d":"10.6"},2.4,{"v":3.7349999999999994,"d":"3.7"},{"v":2.04,"d":"2.0"},{"v":3.17475,"d":"3.2"},{"v":1.52,"d":"1.5"},{"v":2.3655,"d":"2.4"},{"v":1.292,"d":"1.3"},{"v":2.010675,"d":"2.0"},5.2,{"v":8.0925,"d":"8.1"},{"v":4.42,"d":"4.4"},{"v":6.8786249999999995,"d":"6.9"},{"v":5.84,"d":"5.8"},{"v":9.0885,"d":"9.1"},{"v":4.9639999999999995,"d":"5.0"},{"v":7.725224999999999,"d":"7.7"},{"v":0,"d":"0.0"},{"v":100,"d":"100.0"},{"v":0,"d":"0.0"},{"v":100,"d":"100.0"}]
[{"$f":"B25&\"_\"&C25","v":"Pigs fatteners Alfala 1 kg _Finisher"},"Pigs fatteners Alfala 1 kg ","Finisher","Pigs and sows","> 75 kg",{"v":6.3375,"d":"6.3"},{"v":0,"d":"0.0"},{"v":11.5625,"d":"11.6"},{"v":0,"d":"0.0"},{"v":17.1875,"d":"17.2"},{"v":0,"d":"0.0"},{"v":4.6875,"d":"4.7"},{"v":0,"d":"0.0"},{"v":2.1875,"d":"2.2"},{"v":0,"d":"0.0"},{"v":5.9375,"d":"5.9"},{"v":0,"d":"0.0"},{"v":4.6875,"d":"4.7"},{"v":0,"d":"0.0"},{"v":0,"d":"0.0"},{"v":0.9375,"d":"0.9"},{"v":0,"d":"0.0"},{"v":9.0625,"d":"9.1"},{"v":0,"d":"0.0"},{"v":7.703125,"d":"7.7"},{"v":0,"d":"0.0"},{"v":2.71875,"d":"2.7"},{"v":0,"d":"0.0"},{"v":2.3109374999999996,"d":"2.3"},{"v":0,"d":"0.0"},{"v":1.7218749999999998,"d":"1.7"},{"v":0,"d":"0.0"},{"v":1.4635937500000002,"d":"1.5"},{"v":0,"d":"0.0"},{"v":5.890625,"d":"5.9"},{"v":0,"d":"0.0"},{"v":5.007031250000001,"d":"5.0"},{"v":0,"d":"0.0"},{"v":6.6156250000000005,"d":"6.6"},{"v":0,"d":"0.0"},{"v":5.62328125,"d":"5.6"},{"v":0,"d":"0.0"}]
["_"]
["_"]
["_"]
["_"]
["_"]
["_"]
["_"]
["_"]
["_"]
["_"]
["_"]
["_"]
["_"]
["_"]
["_"]
["_"]
["_"]
["_"]
["_"]
["_"]
["_"]
["_"]
["_"]
["_"]
["_"]
["_"]
["_"]
["_"]
["_"]
["_"]
["_"]
[{"$f":"B57&\"_\"&C57","v":"_"}]
["_"]
["_"]
["_"]
["_"]
["_"]
["_"]
["_"]
["_"]
["_"]
["_"]
["_"]
["_"]
["_"]
["_"]
["_"]
["_"]
["_"]
["_"]
["_"]
["_"]
["_"]
["_"]
["_"]
["_"]
["_"]
["_"]
["_"]
["_"]
["_"]
["_"]
["_"]
[{"$f":"B89&\"_\"&C89","v":"_"}]
["_"]
["_"]
["_"]
["_"]
["_"]
["_"]
["_"]
["_"]
["_"]
["_"]
["_"]

{"sheet":"Roughage_Forage","index":4,"n_rows":30,"n_cols":42,"rows_kept":30,"merged":[[1,2,1,5],[1,11,1,13],[1,14,1,19],[2,2,2,5],[2,11,2,13],[2,14,2,19],[3,2,3,5],[3,11,3,13],[3,14,3,19],[4,2,4,5],[4,11,4,13],[4,14,4,19],[5,2,5,5],[6,2,6,5],[19,2,19,3],[20,2,20,3],[22,2,22,3],[24,2,24,3],[25,2,25,3],[26,2,26,3]]}
[]
["STEP 1 : Feeding scenario","Identity of the farm:","Mr example",{"$nulls":8},"Scenario",null,null,"Sows_2_Phasis"]
[null,"Farmer's name:","Guido",{"$nulls":8},"Feeding phase",null,null,"Gestation"]
[null,"Date:","2020-12-10",{"$nulls":3},{"$f":"TEXT(C4,\"aaaammjj\")","v":"20201210"},{"$nulls":4},"Category of animal",null,null,{"$f":"_xlfn.IFNA(VLOOKUP($O$8,Requirement,4,FALSE),)","v":"Pigs and sows"}]
[null,"Objectives(Kg)",100,{"$nulls":8},"Weight/age",null,null,{"$f":"_xlfn.IFNA(VLOOKUP($O$8,Requirement,5,FALSE),)","v":"gestation"}]
[null,"Number of phasis of feeds",2]
[null,"Stage of growth",35]
[{"$nulls":14},{"$f":"O2&\"_\"&O3","v":"Sows_2_Phasis_Gestation"}]
[]
["STEP 2 : Roughage/forage intake and nutritionnal value","Forage","Intake \n(Kg Fresh)","DM  (%)","ME pig adult (MJ/Kg DM)","NE pig adult (MJ/Kg DM)","CP % DM","Fiber % DM","FAT % DM","LYS % DM","THR %  DM","MET % DM","MET+CYS % DM ","TRY % DM","DIS LYS pig %  DM","DIS THR pig % DM","DIS MET pig % DM ","DIS MET+CYS pig % DM","DIS   TRY   PIG % DM","Ca % DM","P % DM","Na % DM"]
[null,"Red clover silage",{"v":1,"d":"1.00"},0.35,{"v":13.6,"d":"13.60"},{"$f":"F17/E17*E11","v":{"v":10.014545454545454,"d":"10.01"}},{"$f":"3.1/0.274","v":{"v":11.313868613138686,"d":"11.31"}},{"v":10,"d":"10.00"},{"v":0,"d":"0.00"},{"v":0,"d":"0.00"},{"v":0,"d":"0.00"},{"v":0,"d":"0.00"},{"v":0,"d":"0.00"},{"v":0,"d":"0.00"},0.61,0.27,0.21,{"v":0,"d":"0.00"},0.06,{"v":0,"d":"0.00"},{"v":0,"d":"0.00"},{"v":0,"d":"0.00"}]
[null,"List",0,0,0,0,0,0,0,0,0,0,0,0,0,0,0,0,0,0,0,0]
[]
[null,"TOTAL FORAGE",{"$f":"SUM(C11:C12)","v":{"v":1,"d":"1.00"}},null,{"$f":"SUMPRODUCT($C$11:$C$12*$D$11:$D$12*E11:E12)","v":4.76},{"$f":"SUMPRODUCT($C$11:$C$12*$D$11:$D$12*F11:F12)","v":{"v":3.5050909090909084,"d":"3.51"}},{"$f":"SUMPRODUCT($C$11:$C$12*$D$11:$D$12*G11:G12)","v":{"v":3.9598540145985397,"d":"3.96"}},{"$f":"SUMPRODUCT($C$11:$C$12*$D$11:$D$12*H11:H12)","v":{"v":3.5,"d":"3.50"}},{"$f":"SUMPRODUCT($C$11:$C$12*$D$11:$D$12*I11:I12)","v":{"v":0,"d":"0.00"}},{"$f":"SUMPRODUCT($C$11:$C$12*$D$11:$D$12*J11:J12)","v":{"v":0,"d":"0.00"}},{"$f":"SUMPRODUCT($C$11:$C$12*$D$11:$D$12*K11:K12)","v":{"v":0,"d":"0.00"}},{"$f":"SUMPRODUCT($C$11:$C$12*$D$11:$D$12*L11:L12)","v":{"v":0,"d":"0.00"}},{"$f":"SUMPRODUCT($C$11:$C$12*$D$11:$D$12*M11:M12)","v":{"v":0,"d":"0.00"}},{"$f":"SUMPRODUCT($C$11:$C$12*$D$11:$D$12*N11:N12)","v":{"v":0,"d":"0.00"}},{"$f":"SUMPRODUCT($C$11:$C$12*$D$11:$D$12*O11:O12)","v":{"v":0.2135,"d":"0.21"}},{"$f":"SUMPRODUCT($C$11:$C$12*$D$11:$D$12*P11:P12)","v":{"v":0.0945,"d":"0.09"}},{"$f":"SUMPRODUCT($C$11:$C$12*$D$11:$D$12*Q11:Q12)","v":{"v":0.0735,"d":"0.07"}},{"$f":"SUMPRODUCT($C$11:$C$12*$D$11:$D$12*R11:R12)","v":{"v":0,"d":"0.00"}},{"$f":"SUMPRODUCT($C$11:$C$12*$D$11:$D$12*S11:S12)","v":{"v":0.020999999999999998,"d":"0.02"}},{"$f":"SUMPRODUCT($C$11:$C$12*$D$11:$D$12*T11:T12)","v":{"v":0,"d":"0.00"}},{"$f":"SUMPRODUCT($C$11:$C$12*$D$11:$D$12*U11:U12)","v":{"v":0,"d":"0.00"}},{"$f":"SUMPRODUCT($C$11:$C$12*$D$11:$D$12*V11:V12)","v":{"v":0,"d":"0.00"}}]
[]
["STEP 3 : Animal needs and classical ration planning",{"$nulls":3},"ME adult pigs","NE adult pigs","CP % max","Fiber Obj","FAT Obj","LYS Min ","THR Min ","MET Min","MET+CYS Min ","TRY  Min","DIS Lys","DIS THR","DIS MET","DIS MET + CYS","DIS TRY","Ca Obj","P Obj","Na Obj "]
[{"$nulls":3},"Min",{"$f":"_xlfn.IFNA(VLOOKUP($O$8,Requirement,6,FALSE),)","v":{"v":11,"d":"11.00"}},{"$f":"_xlfn.IFNA(VLOOKUP($O$8,Requirement,8,FALSE),)","v":{"v":8.1,"d":"8.10"}},{"$f":"_xlfn.IFNA(VLOOKUP($O$8,Requirement,10,FALSE),)","v":{"v":12,"d":"12.00"}},{"$f":"_xlfn.IFNA(VLOOKUP($O$8,Requirement,12,FALSE),)","v":{"v":7,"d":"7.00"}},{"$f":"_xlfn.IFNA(VLOOKUP($O$8,Requirement,14,FALSE),)","v":{"v":1,"d":"1.00"}},{"$f":"_xlfn.IFNA(VLOOKUP($O$8,Requirement,23,FALSE),)","v":{"v":5,"d":"5.00"}},{"$f":"_xlfn.IFNA(VLOOKUP($O$8,Requirement,39,FALSE),)","v":3.65},{"$f":"_xlfn.IFNA(VLOOKUP($O$8,Requirement,27,FALSE),)","v":{"v":1.5,"d":"1.50"}},{"$f":"_xlfn.IFNA(VLOOKUP($O$8,Requirement,35,FALSE),)","v":3.25},{"$f":"_xlfn.IFNA(VLOOKUP($O$8,Requirement,31,FALSE),)","v":0.95},{"$f":"_xlfn.IFNA(VLOOKUP($O$8,Requirement,25,FALSE),)","v":4.25},{"$f":"_xlfn.IFNA(VLOOKUP($O$8,Requirement,41,FALSE),)","v":{"v":3.1025,"d":"3.10"}},{"$f":"_xlfn.IFNA(VLOOKUP($O$8,Requirement,29,FALSE),)","v":{"v":1.275,"d":"1.28"}},{"$f":"_xlfn.IFNA(VLOOKUP($O$8,Requirement,37,FALSE),)","v":{"v":2.7625,"d":"2.76"}},{"$f":"_xlfn.IFNA(VLOOKUP($O$8,Requirement,33,FALSE),)","v":{"v":0.8075,"d":"0.81"}},{"$f":"_xlfn.IFNA(VLOOKUP($O$8,Requirement,16,FALSE),)","v":{"v":5,"d":"5.00"}},{"$f":"_xlfn.IFNA(VLOOKUP($O$8,Requirement,18,FALSE),)","v":{"v":3,"d":"3.00"}},{"$f":"_xlfn.IFNA(VLOOKUP($O$8,Requirement,21,FALSE),)","v":{"v":1,"d":"1.00"}}]
[{"$nulls":3},"Max",{"$f":"_xlfn.IFNA(VLOOKUP($O$8,Requirement,7,FALSE),)","v":{"v":12.5,"d":"12.50"}},{"$f":"_xlfn.IFNA(VLOOKUP($O$8,Requirement,9,FALSE),)","v":{"v":9.6,"d":"9.60"}},{"$f":"_xlfn.IFNA(VLOOKUP($O$8,Requirement,11,FALSE),)","v":{"v":13.5,"d":"13.50"}},{"$f":"_xlfn.IFNA(VLOOKUP($O$8,Requirement,13,FALSE),)","v":{"v":8.5,"d":"8.50"}},{"$f":"_xlfn.IFNA(VLOOKUP($O$8,Requirement,15,FALSE),)","v":{"v":2.5,"d":"2.50"}},{"$f":"_xlfn.IFNA(VLOOKUP($O$8,Requirement,24,FALSE),)","v":{"v":6.5,"d":"6.50"}},{"$f":"_xlfn.IFNA(VLOOKUP($O$8,Requirement,40,FALSE),)","v":{"v":4.745,"d":"4.75"}},{"$f":"_xlfn.IFNA(VLOOKUP($O$8,Requirement,28,FALSE),)","v":1.95},{"$f":"_xlfn.IFNA(VLOOKUP($O$8,Requirement,36,FALSE),)","v":{"v":4.2250000000000005,"d":"4.23"}},{"$f":"_xlfn.IFNA(VLOOKUP($O$8,Requirement,32,FALSE),)","v":{"v":1.235,"d":"1.24"}},{"$f":"_xlfn.IFNA(VLOOKUP($O$8,Requirement,26,FALSE),)","v":{"v":5.5249999999999995,"d":"5.53"}},{"$f":"_xlfn.IFNA(VLOOKUP($O$8,Requirement,42,FALSE),)","v":{"v":4.03325,"d":"4.03"}},{"$f":"_xlfn.IFNA(VLOOKUP($O$8,Requirement,30,FALSE),)","v":{"v":1.6574999999999998,"d":"1.66"}},{"$f":"_xlfn.IFNA(VLOOKUP($O$8,Requirement,38,FALSE),)","v":{"v":3.5912499999999996,"d":"3.59"}},{"$f":"_xlfn.IFNA(VLOOKUP($O$8,Requirement,34,FALSE),)","v":{"v":1.04975,"d":"1.05"}},{"$f":"_xlfn.IFNA(VLOOKUP($O$8,Requirement,17,FALSE),)","v":{"v":6.5,"d":"6.50"}},{"$f":"_xlfn.IFNA(VLOOKUP($O$8,Requirement,19,FALSE),)","v":{"v":4.5,"d":"4.50"}},{"$f":"_xlfn.IFNA(VLOOKUP($O$8,Requirement,22,FALSE),)","v":{"v":2.5,"d":"2.50"}}]
[]
[null,"Kg concentrate/day","Needs",null,"ME adult pigs","NE adult pigs","CP % max","Fiber Obj","FAT Obj","LYS Min ","THR Min ","MET Min","MET+CYS Min ","TRY  Min","DIS Lys","DIS THR","DIS MET","DIS MET + CYS","DIS TRY","Ca Obj","P Obj","Na Obj "]
[null,3.5,"Objective",null,{"$f":"AVERAGE(E17:E18)","v":11.75},8.85,12.75,7.75,1.75,5.75,{"v":4.1975,"d":"4.20"},{"v":1.725,"d":"1.73"},{"v":3.7375000000000003,"d":"3.74"},{"v":1.0925,"d":"1.09"},{"v":4.887499999999999,"d":"4.89"},{"v":3.567875,"d":"3.57"},{"v":1.4662499999999998,"d":"1.47"},{"v":3.176875,"d":"3.18"},{"v":0.928625,"d":"0.93"},5.75,3.75,1.75]
[]
[null,null,"TOTAL NEEDS",null,{"$f":"E21*$B$21","v":{"v":41.125,"d":"41.13"}},{"v":30.974999999999998,"d":"30.98"},{"v":44.625,"d":"44.63"},{"v":27.125,"d":"27.13"},{"v":6.125,"d":"6.13"},{"v":20.125,"d":"20.13"},{"v":14.69125,"d":"14.69"},{"v":6.0375000000000005,"d":"6.04"},{"v":13.08125,"d":"13.08"},{"v":3.82375,"d":"3.82"},{"v":17.106249999999996,"d":"17.11"},{"v":12.4875625,"d":"12.49"},{"v":5.131874999999999,"d":"5.13"},{"v":11.1190625,"d":"11.12"},{"v":3.2501875,"d":"3.25"},{"v":20.125,"d":"20.13"},{"v":13.125,"d":"13.13"},{"v":6.125,"d":"6.13"}]
[]
["STEP 4 : Animal needs cover by concentrate",{"$nulls":3},"ME pig adult (MJ/Kg)","NE pig adult (MJ/Kg)","CP % raw","Fiber % raw","FAT % raw","LYS % raw","THR % raw","MET % Raw","MET+CYS % raw","TRY % raw","DIS LYS pig %  ","DIS THR pig % ","DIS MET pig % ","DIS MET+CYS pig % ","DIS   TRY   PIG% ","Ca % Raw","P % Raw","Na % Raw"]
[null,"TOTAL needs cover by concentrate (TOTAL NEEDS - FORAGE INTAKE)","Kg",null,{"$f":"E23-E14","v":{"v":36.365,"d":"36.37"}},{"v":27.46990909090909,"d":"27.47"},{"v":40.66514598540146,"d":"40.67"},{"v":23.625,"d":"23.63"},{"v":6.125,"d":"6.13"},{"v":20.125,"d":"20.13"},{"v":14.69125,"d":"14.69"},{"v":6.0375000000000005,"d":"6.04"},{"v":13.08125,"d":"13.08"},{"v":3.82375,"d":"3.82"},{"v":16.892749999999996,"d":"16.89"},{"v":12.3930625,"d":"12.39"},{"v":5.058374999999999,"d":"5.06"},{"v":11.1190625,"d":"11.12"},{"v":3.2291875,"d":"3.23"},{"v":20.125,"d":"20.13"},{"v":13.125,"d":"13.13"},{"v":6.125,"d":"6.13"}]
[null,"Objective TOTAL needs/Kg of concentrate",{"v":3.2,"d":"3.20"},null,{"$f":"E26/$C$27","v":{"v":11.3640625,"d":"11.36"}},{"$f":"F26/$C$27","v":{"v":8.58434659090909,"d":"8.58"}},{"v":12.707858120437955,"d":"12.71"},{"v":7.3828125,"d":"7.38"},{"v":1.9140625,"d":"1.91"},{"$f":"J26/$C$27","v":{"v":6.2890625,"d":"6.29"}},{"v":4.591015625,"d":"4.59"},{"v":1.88671875,"d":"1.89"},{"v":4.087890625,"d":"4.09"},{"v":1.194921875,"d":"1.19"},{"v":5.2789843749999985,"d":"5.28"},{"v":3.8728320312499998,"d":"3.87"},{"v":1.5807421874999996,"d":"1.58"},{"v":3.47470703125,"d":"3.47"},{"v":1.00912109375,"d":"1.01"},{"v":6.2890625,"d":"6.29"},{"v":4.1015625,"d":"4.10"},{"v":1.9140625,"d":"1.91"}]
[]
["STEP 5 : Nutritional recommandation for concentrate","Scénarios","Swine requiment ","Type of animals to select inclusing levels","Weight/Age","ME objective (MJ or g/kg)","ME Max ","NE objective (MJ or g/kg)","NE max","CP min","Cp max","Fiber Min ","Fiber max","Fat min","Fat Max","Ca min","Ca max","P min","P max ","P avail","Na min","Na max","Tot Lys min","Tot Lys max","Lys Dig min","Lys Dig max","Met tot min","met tot max","Met Dig min","Met Dig Max","TRY tot min","Try tot max","Try Dig min","Try Dig max","Met+Cys tot min","Met+Cys tot max","Met+Cys Dig min","Met+Cys Dig Max","Thr tot min","Thr tot max","Thr Dig min","Thr Dig max"]
["Copy",{"$f":"CONCATENATE(O3,\"_\",O2,\"_\",B11,\"_\",C11,\"Kg\")","v":"Gestation_Sows_2_Phasis_Red clover silage_1Kg"},{"$f":"O3","v":"Gestation"},{"$f":"O4","v":"Pigs and sows"},{"$f":"O5","v":"gestation"},{"$f":"E27","v":{"v":11.3640625,"d":"11.36"}},0,{"$f":"F27","v":{"v":8.58434659090909,"d":"8.58"}},0,{"$f":"G27","v":{"v":12.707858120437955,"d":"12.71"}},0,{"$f":"H27","v":{"v":7.3828125,"d":"7.38"}},0,{"$f":"I27","v":{"v":1.9140625,"d":"1.91"}},0,{"$f":"T27","v":{"v":6.2890625,"d":"6.29"}},0,{"$f":"U27","v":{"v":4.1015625,"d":"4.10"}},0,0,{"$f":"V27","v":{"v":1.9140625,"d":"1.91"}},0,{"$f":"J27","v":{"v":6.2890625,"d":"6.29"}},0,{"$f":"O27","v":{"v":5.2789843749999985,"d":"5.28"}},0,{"$f":"L27","v":{"v":1.88671875,"d":"1.89"}},0,{"$f":"Q27","v":{"v":1.5807421874999996,"d":"1.58"}},0,{"$f":"N27","v":{"v":1.194921875,"d":"1.19"}},0,{"$f":"S27","v":{"v":1.00912109375,"d":"1.01"}},0,{"$f":"M27","v":{"v":4.087890625,"d":"4.09"}},0,{"$f":"R27","v":{"v":3.47470703125,"d":"3.47"}},0,{"$f":"K27","v":{"v":4.591015625,"d":"4.59"}},0,{"$f":"P27","v":{"v":3.8728320312499998,"d":"3.87"}},0]

{"sheet":"PDF_Export","index":5,"n_rows":53,"n_cols":7,"rows_kept":53}
[null,{"$f":"CONCATENATE(\"RATION REALIZED ON: \"&TEXT(Tool!E5,\"jj/mm/aaaa\"))","v":"RATION REALIZED ON: 10/12/2020"}]
[]
[null,"Context:"]
[null,{"$f":"Tool!D3","v":"Identity of the farm:"},{"$f":"IF(Tool!E3<>\"\",Tool!E3,\"\")","v":"Mr example"}]
[null,{"$f":"Tool!D4","v":"Farmer's name:"},{"$f":"IF(Tool!E4<>\"\",Tool!E4,\"\")","v":"Guido"}]
[null,{"$f":"Tool!D5","v":"Date:"},{"$f":"IF(Tool!E5<>\"\",Tool!E5,\"\")","v":"2020-12-10"}]
[null,{"$f":"Tool!D6","v":"Objectives(Kg)"},{"$f":"IF(Tool!E6<>\"\",Tool!E6,\"\")","v":100}]
[null,{"$f":"Tool!D7","v":"Number of phasis of feeds"},{"$f":"IF(Tool!E7<>\"\",Tool!E7,\"\")","v":2}]
[null,{"$f":"Tool!D8","v":"Stage of growth"},{"$f":"IF(Tool!E8<>\"\",Tool!E8,\"\")","v":35}]
[]
[null,"Scenario seleected"]
[null,"Tool scenario:",{"$f":"Tool!Q3&\"_\"&Tool!Q4","v":"Gestating sow red clover silage 1 kg_Finisher"}]
[]
[null,"Feedstuff composition:",{"$f":"Tool!E9","v":500},"Kg"]
[]
[null,null,"%","Kg","% Costs","Cost (€/T)"]
[null,{"$f":"IF(Tool!D12<>\"\",IF(Tool!F12<>0,Tool!D12,\"\"),\"\")","v":""},{"$f":"IF(Tool!F12<>\"\",IF(Tool!F12<>0,Tool!F12,\"\"))","v":""},{"$f":"IF(Tool!E12<>\"\",IF(Tool!E12<>0,Tool!E12,\"\"),\"\")","v":""},{"$f":"IF(B17<>\"\",Tool!AH12,\"\")","v":""},{"$f":"IF(B17<>\"\",Tool!AF12,\"\")","v":""},{"$f":"IF(F17<>\"\",\"/Tonne\",\"\")","v":""}]
[null,{"$f":"IF(Tool!D13<>\"\",IF(Tool!F13<>0,Tool!D13,\"\"),\"\")","v":""},{"$f":"IF(Tool!F13<>\"\",IF(Tool!F13<>0,Tool!F13,\"\"))","v":""},{"$f":"IF(Tool!E13<>\"\",IF(Tool!E13<>0,Tool!E13,\"\"),\"\")","v":""},{"$f":"IF(B18<>\"\",Tool!AH13,\"\")","v":""},{"$f":"IF(B18<>\"\",Tool!AF13,\"\")","v":""},{"$f":"IF(F18<>\"\",\"/Tonne\",\"\")","v":""}]
[null,{"$f":"IF(Tool!D14<>\"\",IF(Tool!F14<>0,Tool!D14,\"\"),\"\")","v":""},{"$f":"IF(Tool!F14<>\"\",IF(Tool!F14<>0,Tool!F14,\"\"))","v":""},{"$f":"IF(Tool!E14<>\"\",IF(Tool!E14<>0,Tool!E14,\"\"),\"\")","v":""},{"$f":"IF(B19<>\"\",Tool!AH14,\"\")","v":""},{"$f":"IF(B19<>\"\",Tool!AF14,\"\")","v":""},{"$f":"IF(F19<>\"\",\"/Tonne\",\"\")","v":""}]
[null,{"$f":"IF(Tool!D15<>\"\",IF(Tool!F15<>0,Tool!D15,\"\"),\"\")","v":""},{"$f":"IF(Tool!F15<>\"\",IF(Tool!F15<>0,Tool!F15,\"\"))","v":""},{"$f":"IF(Tool!E15<>\"\",IF(Tool!E15<>0,Tool!E15,\"\"),\"\")","v":""},{"$f":"IF(B20<>\"\",Tool!AH15,\"\")","v":""},{"$f":"IF(B20<>\"\",Tool!AF15,\"\")","v":""},{"$f":"IF(F20<>\"\",\"/Tonne\",\"\")","v":""}]
[null,{"$f":"IF(Tool!D16<>\"\",IF(Tool!F16<>0,Tool!D16,\"\"),\"\")","v":""},{"$f":"IF(Tool!F16<>\"\",IF(Tool!F16<>0,Tool!F16,\"\"))","v":""},{"$f":"IF(Tool!E16<>\"\",IF(Tool!E16<>0,Tool!E16,\"\"),\"\")","v":""},{"$f":"IF(B21<>\"\",Tool!AH16,\"\")","v":""},{"$f":"IF(B21<>\"\",Tool!AF16,\"\")","v":""},{"$f":"IF(F21<>\"\",\"/Tonne\",\"\")","v":""}]
[null,{"$f":"IF(Tool!D17<>\"\",IF(Tool!F17<>0,Tool!D17,\"\"),\"\")","v":""},{"$f":"IF(Tool!F17<>\"\",IF(Tool!F17<>0,Tool!F17,\"\"))","v":""},{"$f":"IF(Tool!E17<>\"\",IF(Tool!E17<>0,Tool!E17,\"\"),\"\")","v":""},{"$f":"IF(B22<>\"\",Tool!AH17,\"\")","v":""},{"$f":"IF(B22<>\"\",Tool!AF17,\"\")","v":""},{"$f":"IF(F22<>\"\",\"/Tonne\",\"\")","v":""}]
[null,{"$f":"IF(Tool!D18<>\"\",IF(Tool!F18<>0,Tool!D18,\"\"),\"\")","v":""},{"$f":"IF(Tool!F18<>\"\",IF(Tool!F18<>0,Tool!F18,\"\"))","v":""},{"$f":"IF(Tool!E18<>\"\",IF(Tool!E18<>0,Tool!E18,\"\"),\"\")","v":""},{"$f":"IF(B23<>\"\",Tool!AH18,\"\")","v":""},{"$f":"IF(B23<>\"\",Tool!AF18,\"\")","v":""},{"$f":"IF(F23<>\"\",\"/Tonne\",\"\")","v":""}]
[null,{"$f":"IF(Tool!D19<>\"\",IF(Tool!F19<>0,Tool!D19,\"\"),\"\")","v":""},{"$f":"IF(Tool!F19<>\"\",IF(Tool!F19<>0,Tool!F19,\"\"))","v":""},{"$f":"IF(Tool!E19<>\"\",IF(Tool!E19<>0,Tool!E19,\"\"),\"\")","v":""},{"$f":"IF(B24<>\"\",Tool!AH19,\"\")","v":""},{"$f":"IF(B24<>\"\",Tool!AF19,\"\")","v":""},{"$f":"IF(F24<>\"\",\"/Tonne\",\"\")","v":""}]
[null,{"$f":"IF(Tool!D20<>\"\",IF(Tool!F20<>0,Tool!D20,\"\"),\"\")","v":""},{"$f":"IF(Tool!F20<>\"\",IF(Tool!F20<>0,Tool!F20,\"\"))","v":""},{"$f":"IF(Tool!E20<>\"\",IF(Tool!E20<>0,Tool!E20,\"\"),\"\")","v":""},{"$f":"IF(B25<>\"\",Tool!AH20,\"\")","v":""},{"$f":"IF(B25<>\"\",Tool!AF20,\"\")","v":""},{"$f":"IF(F25<>\"\",\"/Tonne\",\"\")","v":""}]
[null,{"$f":"IF(Tool!D23<>\"\",IF(Tool!F23<>0,Tool!D23,\"\"),\"\")","v":""},{"$f":"IF(Tool!F23<>\"\",IF(Tool!F23<>0,Tool!F23,\"\"))","v":""},{"$f":"IF(Tool!E23<>\"\",IF(Tool!E23<>0,Tool!E23,\"\"),\"\")","v":""},{"$f":"IF(B26<>\"\",Tool!AH23,\"\")","v":""},{"$f":"IF(B26<>\"\",Tool!AF23,\"\")","v":""},{"$f":"IF(F26<>\"\",\"/Tonne\",\"\")","v":""}]
[]
[null,"Number of feedstuffs:",{"$f":"10-COUNTBLANK(B17:B26)","v":0}]
[null,"Ration cost ",{"$f":"Tool!AG27","v":0},"/Tonne"]
[]
[null,"Ration results:"]
[]
[null,null,"TOTAL",null,null,"Min","Max"]
[null,"ME growing pig (MJ/Kg)",{"$f":"Tool!G25","v":{"v":0,"d":"0.00"}},"Mj/Kg",null,{"$f":"Tool!G28","v":{"v":0,"d":"0.00"}},{"$f":"Tool!G29","v":{"v":0,"d":"0.00"}}]
[null,"NE growing pig  (MJ/Kg)",{"$f":"Tool!H25","v":{"v":0,"d":"0.00"}},"Mj/Kg",null,{"$f":"Tool!H28","v":{"v":0,"d":"0.00"}},{"$f":"Tool!H29","v":{"v":0,"d":"0.00"}}]
[null,"ME pig adult (MJ/Kg)",{"$f":"Tool!I25","v":{"v":0,"d":"0.00"}},"Mj/Kg",null,{"$f":"Tool!I28","v":{"v":0,"d":"0.00"}},{"$f":"Tool!I29","v":{"v":0,"d":"0.00"}}]
[null,"NE pig adult (MJ/Kg)",{"$f":"Tool!J25","v":{"v":0,"d":"0.00"}},"Mj/Kg",null,{"$f":"Tool!J28","v":{"v":0,"d":"0.00"}},{"$f":"Tool!J29","v":{"v":0,"d":"0.00"}}]
[null,"CP % raw",{"$f":"Tool!K25","v":{"v":0,"d":"0.00"}},"%",null,{"$f":"Tool!K28","v":{"v":0,"d":"0.00"}},{"$f":"Tool!K29","v":{"v":0,"d":"0.00"}}]
[null,"Fiber % raw",{"$f":"Tool!L25","v":{"v":0,"d":"0.00"}},"%",null,{"$f":"Tool!L28","v":{"v":0,"d":"0.00"}},{"$f":"Tool!L29","v":{"v":0,"d":"0.00"}}]
[null,"FAT % raw",{"$f":"Tool!M25","v":{"v":0,"d":"0.00"}},"%",null,{"$f":"Tool!M28","v":{"v":0,"d":"0.00"}},{"$f":"Tool!M29","v":{"v":0,"d":"0.00"}}]
[null,"LYS % raw",{"$f":"Tool!N25","v":{"v":0,"d":"0.00"}},"%",null,{"$f":"Tool!N28","v":{"v":0,"d":"0.00"}},{"$f":"Tool!N29","v":{"v":0,"d":"0.00"}}]
[null,"THR % raw",{"$f":"Tool!O25","v":{"v":0,"d":"0.00"}},"%",null,{"$f":"Tool!O28","v":{"v":0,"d":"0.00"}},{"$f":"Tool!O29","v":{"v":0,"d":"0.00"}}]
[null,"MET % Raw",{"$f":"Tool!P25","v":{"v":0,"d":"0.00"}},"%",null,{"$f":"Tool!P28","v":{"v":0,"d":"0.00"}},{"$f":"Tool!P29","v":{"v":0,"d":"0.00"}}]
[null,"MET+CYS % raw",{"$f":"Tool!Q25","v":{"v":0,"d":"0.00"}},"%",null,{"$f":"Tool!Q28","v":{"v":0,"d":"0.00"}},{"$f":"Tool!Q29","v":{"v":0,"d":"0.00"}}]
[null,"TRY % raw",{"$f":"Tool!R25","v":{"v":0,"d":"0.00"}},"%",null,{"$f":"Tool!R28","v":{"v":0,"d":"0.00"}},{"$f":"Tool!R29","v":{"v":0,"d":"0.00"}}]
[null,"DIS LYS pig %  ",{"$f":"Tool!S25","v":{"v":0,"d":"0.00"}},"%",null,{"$f":"Tool!S28","v":{"v":0,"d":"0.00"}},{"$f":"Tool!S29","v":{"v":0,"d":"0.00"}}]
[null,"DIS THR pig % ",{"$f":"Tool!T25","v":{"v":0,"d":"0.00"}},"%",null,{"$f":"Tool!T28","v":{"v":0,"d":"0.00"}},{"$f":"Tool!T29","v":{"v":0,"d":"0.00"}}]
[null,"DIS MET pig % ",{"$f":"Tool!U25","v":{"v":0,"d":"0.00"}},"%",null,{"$f":"Tool!U28","v":{"v":0,"d":"0.00"}},{"$f":"Tool!U29","v":{"v":0,"d":"0.00"}}]
[null,"DIS MET+CYS pig % ",{"$f":"Tool!V25","v":{"v":0,"d":"0.00"}},"%",null,{"$f":"Tool!V28","v":{"v":0,"d":"0.00"}},{"$f":"Tool!V29","v":{"v":0,"d":"0.00"}}]
[null,"DIS   TRY   PIG% ",{"$f":"Tool!W25","v":{"v":0,"d":"0.00"}},"%",null,{"$f":"Tool!W28","v":{"v":0,"d":"0.00"}},{"$f":"Tool!W29","v":{"v":0,"d":"0.00"}}]
[null,"Ca % Raw",{"$f":"Tool!X25","v":{"v":0,"d":"0.00"}},"%",null,{"$f":"Tool!X28","v":{"v":0,"d":"0.00"}},{"$f":"Tool!X29","v":{"v":0,"d":"0.00"}}]
[null,"P % Raw",{"$f":"Tool!Y25","v":{"v":0,"d":"0.00"}},"%",null,{"$f":"Tool!Y28","v":{"v":0,"d":"0.00"}},{"$f":"Tool!Y29","v":{"v":0,"d":"0.00"}}]
[null,"Na % Raw",{"$f":"Tool!Z25","v":{"v":0,"d":"0.00"}},"%",null,{"$f":"Tool!Z28","v":{"v":0,"d":"0.00"}},{"$f":"Tool!Z29","v":{"v":0,"d":"0.00"}}]

{"sheet":"About","index":6,"n_rows":0,"n_cols":0,"rows_kept":0}

{"sheet":"References","index":7,"n_rows":0,"n_cols":0,"rows_kept":0}

{"sheet":"Contribution","index":8,"n_rows":12,"n_cols":10,"rows_kept":12,"hidden":true}
["Feedstuffs - ME - Growing Pigs","% of contribution off each feedstuff for Energy (pigs)","Feedstuffs - ME - Adults","% of contribution off each feedstuff for Energy (Adults)","Feedstuffs CP","% of contribution off each feedstuff for Proteins","Feedstuffs LYS","% of contribution off each feedstuff for Lysine","Feedstuffs MET","% of contribution off each feedstuff for Methionine"]
[{"$f":"IF(B2<>0,Tool!D12,\"\")","v":{"$error":"#DIV/0!"}},{"$f":"Tool!G12*Tool!F12/Tool!$G$25","v":{"$error":"#DIV/0!"}},{"$f":"IF(D2<>0,Tool!D12,\"\")","v":{"$error":"#DIV/0!"}},{"$f":"Tool!H12*Tool!F12/Tool!$H$25","v":{"$error":"#DIV/0!"}},{"$f":"IF(F2<>0,Tool!D12,\"\")","v":{"$error":"#DIV/0!"}},{"$f":"Tool!K12*Tool!F12/Tool!$K$25","v":{"$error":"#DIV/0!"}},{"$f":"IF(H2<>0,Tool!D12,\"\")","v":{"$error":"#DIV/0!"}},{"$f":"Tool!N12*Tool!F12/Tool!$N$25*10","v":{"$error":"#DIV/0!"}},{"$f":"IF(J2<>0,Tool!D12,\"\")","v":{"$error":"#DIV/0!"}},{"$f":"Tool!P12*Tool!F12/Tool!$P$25*10","v":{"$error":"#DIV/0!"}}]
[{"$f":"IF(B3<>0,Tool!D13,\"\")","v":{"$error":"#DIV/0!"}},{"$f":"Tool!G13*Tool!F13/Tool!$G$25","v":{"$error":"#DIV/0!"}},{"$f":"IF(D3<>0,Tool!D13,\"\")","v":{"$error":"#DIV/0!"}},{"$f":"Tool!H13*Tool!F13/Tool!$H$25","v":{"$error":"#DIV/0!"}},{"$f":"IF(F3<>0,Tool!D13,\"\")","v":{"$error":"#DIV/0!"}},{"$f":"Tool!K13*Tool!F13/Tool!$K$25","v":{"$error":"#DIV/0!"}},{"$f":"IF(H3<>0,Tool!D13,\"\")","v":{"$error":"#DIV/0!"}},{"$f":"Tool!N13*Tool!F13/Tool!$N$25*10","v":{"$error":"#DIV/0!"}},{"$f":"IF(J3<>0,Tool!D13,\"\")","v":{"$error":"#DIV/0!"}},{"$f":"Tool!P13*Tool!F13/Tool!$P$25*10","v":{"$error":"#DIV/0!"}}]
[{"$f":"IF(B4<>0,Tool!D14,\"\")","v":{"$error":"#DIV/0!"}},{"$f":"Tool!G14*Tool!F14/Tool!$G$25","v":{"$error":"#DIV/0!"}},{"$f":"IF(D4<>0,Tool!D14,\"\")","v":{"$error":"#DIV/0!"}},{"$f":"Tool!H14*Tool!F14/Tool!$H$25","v":{"$error":"#DIV/0!"}},{"$f":"IF(F4<>0,Tool!D14,\"\")","v":{"$error":"#DIV/0!"}},{"$f":"Tool!K14*Tool!F14/Tool!$K$25","v":{"$error":"#DIV/0!"}},{"$f":"IF(H4<>0,Tool!D14,\"\")","v":{"$error":"#DIV/0!"}},{"$f":"Tool!N14*Tool!F14/Tool!$N$25*10","v":{"$error":"#DIV/0!"}},{"$f":"IF(J4<>0,Tool!D14,\"\")","v":{"$error":"#DIV/0!"}},{"$f":"Tool!P14*Tool!F14/Tool!$P$25*10","v":{"$error":"#DIV/0!"}}]
[{"$f":"IF(B5<>0,Tool!D15,\"\")","v":{"$error":"#DIV/0!"}},{"$f":"Tool!G15*Tool!F15/Tool!$G$25","v":{"$error":"#DIV/0!"}},{"$f":"IF(D5<>0,Tool!D15,\"\")","v":{"$error":"#DIV/0!"}},{"$f":"Tool!H15*Tool!F15/Tool!$H$25","v":{"$error":"#DIV/0!"}},{"$f":"IF(F5<>0,Tool!D15,\"\")","v":{"$error":"#DIV/0!"}},{"$f":"Tool!K15*Tool!F15/Tool!$K$25","v":{"$error":"#DIV/0!"}},{"$f":"IF(H5<>0,Tool!D15,\"\")","v":{"$error":"#DIV/0!"}},{"$f":"Tool!N15*Tool!F15/Tool!$N$25*10","v":{"$error":"#DIV/0!"}},{"$f":"IF(J5<>0,Tool!D15,\"\")","v":{"$error":"#DIV/0!"}},{"$f":"Tool!P15*Tool!F15/Tool!$P$25*10","v":{"$error":"#DIV/0!"}}]
[{"$f":"IF(B6<>0,Tool!D16,\"\")","v":{"$error":"#DIV/0!"}},{"$f":"Tool!G16*Tool!F16/Tool!$G$25","v":{"$error":"#DIV/0!"}},{"$f":"IF(D6<>0,Tool!D16,\"\")","v":{"$error":"#DIV/0!"}},{"$f":"Tool!H16*Tool!F16/Tool!$H$25","v":{"$error":"#DIV/0!"}},{"$f":"IF(F6<>0,Tool!D16,\"\")","v":{"$error":"#DIV/0!"}},{"$f":"Tool!K16*Tool!F16/Tool!$K$25","v":{"$error":"#DIV/0!"}},{"$f":"IF(H6<>0,Tool!D16,\"\")","v":{"$error":"#DIV/0!"}},{"$f":"Tool!N16*Tool!F16/Tool!$N$25*10","v":{"$error":"#DIV/0!"}},{"$f":"IF(J6<>0,Tool!D16,\"\")","v":{"$error":"#DIV/0!"}},{"$f":"Tool!P16*Tool!F16/Tool!$P$25*10","v":{"$error":"#DIV/0!"}}]
[{"$f":"IF(B7<>0,Tool!D17,\"\")","v":{"$error":"#DIV/0!"}},{"$f":"Tool!G17*Tool!F17/Tool!$G$25","v":{"$error":"#DIV/0!"}},{"$f":"IF(D7<>0,Tool!D17,\"\")","v":{"$error":"#DIV/0!"}},{"$f":"Tool!H17*Tool!F17/Tool!$H$25","v":{"$error":"#DIV/0!"}},{"$f":"IF(F7<>0,Tool!D17,\"\")","v":{"$error":"#DIV/0!"}},{"$f":"Tool!K17*Tool!F17/Tool!$K$25","v":{"$error":"#DIV/0!"}},{"$f":"IF(H7<>0,Tool!D17,\"\")","v":{"$error":"#DIV/0!"}},{"$f":"Tool!N17*Tool!F17/Tool!$N$25*10","v":{"$error":"#DIV/0!"}},{"$f":"IF(J7<>0,Tool!D17,\"\")","v":{"$error":"#DIV/0!"}},{"$f":"Tool!P17*Tool!F17/Tool!$P$25*10","v":{"$error":"#DIV/0!"}}]
[{"$f":"IF(B8<>0,Tool!D18,\"\")","v":{"$error":"#DIV/0!"}},{"$f":"Tool!G18*Tool!F18/Tool!$G$25","v":{"$error":"#DIV/0!"}},{"$f":"IF(D8<>0,Tool!D18,\"\")","v":{"$error":"#DIV/0!"}},{"$f":"Tool!H18*Tool!F18/Tool!$H$25","v":{"$error":"#DIV/0!"}},{"$f":"IF(F8<>0,Tool!D18,\"\")","v":{"$error":"#DIV/0!"}},{"$f":"Tool!K18*Tool!F18/Tool!$K$25","v":{"$error":"#DIV/0!"}},{"$f":"IF(H8<>0,Tool!D18,\"\")","v":{"$error":"#DIV/0!"}},{"$f":"Tool!N18*Tool!F18/Tool!$N$25*10","v":{"$error":"#DIV/0!"}},{"$f":"IF(J8<>0,Tool!D18,\"\")","v":{"$error":"#DIV/0!"}},{"$f":"Tool!P18*Tool!F18/Tool!$P$25*10","v":{"$error":"#DIV/0!"}}]
[{"$f":"IF(B9<>0,Tool!D19,\"\")","v":{"$error":"#DIV/0!"}},{"$f":"Tool!G19*Tool!F19/Tool!$G$25","v":{"$error":"#DIV/0!"}},{"$f":"IF(D9<>0,Tool!D19,\"\")","v":{"$error":"#DIV/0!"}},{"$f":"Tool!H19*Tool!F19/Tool!$H$25","v":{"$error":"#DIV/0!"}},{"$f":"IF(F9<>0,Tool!D19,\"\")","v":{"$error":"#DIV/0!"}},{"$f":"Tool!K19*Tool!F19/Tool!$K$25","v":{"$error":"#DIV/0!"}},{"$f":"IF(H9<>0,Tool!D19,\"\")","v":{"$error":"#DIV/0!"}},{"$f":"Tool!N19*Tool!F19/Tool!$N$25*10","v":{"$error":"#DIV/0!"}},{"$f":"IF(J9<>0,Tool!D19,\"\")","v":{"$error":"#DIV/0!"}},{"$f":"Tool!P19*Tool!F19/Tool!$P$25*10","v":{"$error":"#DIV/0!"}}]
[{"$f":"IF(B10<>0,Tool!D20,\"\")","v":{"$error":"#DIV/0!"}},{"$f":"Tool!G20*Tool!F20/Tool!$G$25","v":{"$error":"#DIV/0!"}},{"$f":"IF(D10<>0,Tool!D20,\"\")","v":{"$error":"#DIV/0!"}},{"$f":"Tool!H20*Tool!F20/Tool!$H$25","v":{"$error":"#DIV/0!"}},{"$f":"IF(F10<>0,Tool!D20,\"\")","v":{"$error":"#DIV/0!"}},{"$f":"Tool!K20*Tool!F20/Tool!$K$25","v":{"$error":"#DIV/0!"}},{"$f":"IF(H10<>0,Tool!D20,\"\")","v":{"$error":"#DIV/0!"}},{"$f":"Tool!N20*Tool!F20/Tool!$N$25*10","v":{"$error":"#DIV/0!"}},{"$f":"IF(J10<>0,Tool!D20,\"\")","v":{"$error":"#DIV/0!"}},{"$f":"Tool!P20*Tool!F20/Tool!$P$25*10","v":{"$error":"#DIV/0!"}}]
[{"$f":"IF(B11<>0,Tool!D23,\"\")","v":{"$error":"#DIV/0!"}},{"$f":"Tool!G23*Tool!F23/Tool!$G$25","v":{"$error":"#DIV/0!"}},{"$f":"IF(D11<>0,Tool!D23,\"\")","v":{"$error":"#DIV/0!"}},{"$f":"Tool!H23*Tool!F23/Tool!$H$25","v":{"$error":"#DIV/0!"}},{"$f":"IF(F11<>0,Tool!D23,\"\")","v":{"$error":"#DIV/0!"}},{"$f":"Tool!K23*Tool!F23/Tool!$K$25","v":{"$error":"#DIV/0!"}},{"$f":"IF(H11<>0,Tool!D23,\"\")","v":{"$error":"#DIV/0!"}},{"$f":"Tool!N23*Tool!F23/Tool!$N$25*10","v":{"$error":"#DIV/0!"}},{"$f":"IF(J11<>0,Tool!D23,\"\")","v":{"$error":"#DIV/0!"}},{"$f":"Tool!P23*Tool!F23/Tool!$P$25*10","v":{"$error":"#DIV/0!"}}]
["TOTAL",{"$f":"SUM(B2:B11)","v":{"$error":"#DIV/0!"}},{"$f":"IF(D12<>0,Tool!D24,\"\")","v":{"$error":"#DIV/0!"}},{"$f":"SUM(D2:D11)","v":{"$error":"#DIV/0!"}},null,{"$error":"#DIV/0!"},{"$f":"IF(H12<>0,Tool!D24,\"\")","v":{"$error":"#DIV/0!"}},{"$error":"#DIV/0!"},{"$f":"IF(J12<>0,Tool!D24,\"\")","v":{"$error":"#DIV/0!"}},{"$error":"#DIV/0!"}]

{"sheet":"List_sheet","index":9,"n_rows":100,"n_cols":10,"rows_kept":100,"hidden":true}
["Valeur scenarios","Ligne","Ligne filtrée","Ligne triee","Liste unique scenarios","Valeur formula","Ligne","Ligne filtrée","Ligne triee","Liste unique Formula"]
[{"$f":"IFERROR(Table2[[#This Row],[Scénarios]],\"\")","v":"Pigs_2_Phasis"},{"$f":"ROW()-1","v":1},{"$f":"IF(COUNTIF($A$2:A2,A2)=1,ROW()-1,\"\")","v":1},{"$f":"IFERROR(SMALL(C:C,B2),\"\")","v":1},{"$f":"IFERROR(INDEX($A$2:$A$99,D2),\"\")","v":"Pigs_2_Phasis"},{"$f":"IFERROR(Table2[[#This Row],[Swine requiment ]],\"\")","v":"Grower"},{"$f":"ROW()-1","v":1},{"$f":"IF(COUNTIF($F$2:F2,F2)=1,ROW()-1,\"\")","v":1},{"$f":"IFERROR(SMALL(H:H,G2),\"\")","v":1},{"$f":"IFERROR(INDEX($F$2:$F$99,I2),\"\")","v":"Grower"}]
[{"$f":"IFERROR(Table2[[#This Row],[Scénarios]],\"\")","v":"Pigs_2_Phasis"},{"$f":"ROW()-1","v":2},{"$f":"IF(COUNTIF($A$2:A3,A3)=1,ROW()-1,\"\")","v":""},{"$f":"IFERROR(SMALL(C:C,B3),\"\")","v":3},{"$f":"IFERROR(INDEX($A$2:$A$99,D3),\"\")","v":"Pigs_3_Phasis"},{"$f":"IFERROR(Table2[[#This Row],[Swine requiment ]],\"\")","v":"Weaners"},{"$f":"ROW()-1","v":2},{"$f":"IF(COUNTIF($F$2:F3,F3)=1,ROW()-1,\"\")","v":2},{"$f":"IFERROR(SMALL(H:H,G3),\"\")","v":2},{"$f":"IFERROR(INDEX($F$2:$F$99,I3),\"\")","v":"Weaners"}]
[{"$f":"IFERROR(Table2[[#This Row],[Scénarios]],\"\")","v":"Pigs_3_Phasis"},3,{"$f":"IF(COUNTIF($A$2:A4,A4)=1,ROW()-1,\"\")","v":3},6,"Pigs_Fatteners_3_Phasis",{"$f":"IFERROR(Table2[[#This Row],[Swine requiment ]],\"\")","v":"Weaners"},3,{"$f":"IF(COUNTIF($F$2:F4,F4)=1,ROW()-1,\"\")","v":""},5,"Finisher"]
[{"$f":"IFERROR(Table2[[#This Row],[Scénarios]],\"\")","v":"Pigs_3_Phasis"},4,{"$f":"IF(COUNTIF($A$2:A5,A5)=1,ROW()-1,\"\")","v":""},9,"Multi-Phasis",{"$f":"IFERROR(Table2[[#This Row],[Swine requiment ]],\"\")","v":"Grower"},4,{"$f":"IF(COUNTIF($F$2:F5,F5)=1,ROW()-1,\"\")","v":""},6,"Grower_1"]
[{"$f":"IFERROR(Table2[[#This Row],[Scénarios]],\"\")","v":"Pigs_3_Phasis"},5,{"$f":"IF(COUNTIF($A$2:A6,A6)=1,ROW()-1,\"\")","v":""},14,"Single_Feeding",{"$f":"IFERROR(Table2[[#This Row],[Swine requiment ]],\"\")","v":"Finisher"},5,{"$f":"IF(COUNTIF($F$2:F6,F6)=1,ROW()-1,\"\")","v":5},7,"Grower_2"]
[{"$f":"IFERROR(Table2[[#This Row],[Scénarios]],\"\")","v":"Pigs_Fatteners_3_Phasis"},6,{"$f":"IF(COUNTIF($A$2:A7,A7)=1,ROW()-1,\"\")","v":6},17,"Sow_Single_Feeding",{"$f":"IFERROR(Table2[[#This Row],[Swine requiment ]],\"\")","v":"Grower_1"},6,{"$f":"IF(COUNTIF($F$2:F7,F7)=1,ROW()-1,\"\")","v":6},10,"Piglets"]
[{"$f":"IFERROR(Table2[[#This Row],[Scénarios]],\"\")","v":"Pigs_Fatteners_3_Phasis"},7,{"$f":"IF(COUNTIF($A$2:A8,A8)=1,ROW()-1,\"\")","v":""},18,"Sows_2_Phasis",{"$f":"IFERROR(Table2[[#This Row],[Swine requiment ]],\"\")","v":"Grower_2"},7,{"$f":"IF(COUNTIF($F$2:F8,F8)=1,ROW()-1,\"\")","v":7},17,"Lactation"]
[{"$f":"IFERROR(Table2[[#This Row],[Scénarios]],\"\")","v":"Pigs_Fatteners_3_Phasis"},8,{"$f":"IF(COUNTIF($A$2:A9,A9)=1,ROW()-1,\"\")","v":""},20,"Sows_4_Phasis",{"$f":"IFERROR(Table2[[#This Row],[Swine requiment ]],\"\")","v":"Finisher"},8,{"$f":"IF(COUNTIF($F$2:F9,F9)=1,ROW()-1,\"\")","v":""},18,"Gestation"]
[{"$f":"IFERROR(Table2[[#This Row],[Scénarios]],\"\")","v":"Multi-Phasis"},9,{"$f":"IF(COUNTIF($A$2:A10,A10)=1,ROW()-1,\"\")","v":9},24,"Pigs fatteners Alfala 1 kg ",{"$f":"IFERROR(Table2[[#This Row],[Swine requiment ]],\"\")","v":"Weaners"},9,{"$f":"IF(COUNTIF($F$2:F10,F10)=1,ROW()-1,\"\")","v":""},20,"Early gestation"]
[{"$f":"IFERROR(Table2[[#This Row],[Scénarios]],\"\")","v":"Multi-Phasis"},10,{"$f":"IF(COUNTIF($A$2:A11,A11)=1,ROW()-1,\"\")","v":""},25,0,{"$f":"IFERROR(Table2[[#This Row],[Swine requiment ]],\"\")","v":"Piglets"},10,{"$f":"IF(COUNTIF($F$2:F11,F11)=1,ROW()-1,\"\")","v":10},21,"Late gestation"]
[{"$f":"IFERROR(Table2[[#This Row],[Scénarios]],\"\")","v":"Multi-Phasis"},11,{"$f":"IF(COUNTIF($A$2:A12,A12)=1,ROW()-1,\"\")","v":""},"","",{"$f":"IFERROR(Table2[[#This Row],[Swine requiment ]],\"\")","v":"Grower_1"},11,{"$f":"IF(COUNTIF($F$2:F12,F12)=1,ROW()-1,\"\")","v":""},22,"Early lactation"]
[{"$f":"IFERROR(Table2[[#This Row],[Scénarios]],\"\")","v":"Multi-Phasis"},12,{"$f":"IF(COUNTIF($A$2:A13,A13)=1,ROW()-1,\"\")","v":""},"","",{"$f":"IFERROR(Table2[[#This Row],[Swine requiment ]],\"\")","v":"Grower_2"},12,{"$f":"IF(COUNTIF($F$2:F13,F13)=1,ROW()-1,\"\")","v":""},23,"Late lactation"]
[{"$f":"IFERROR(Table2[[#This Row],[Scénarios]],\"\")","v":"Multi-Phasis"},13,{"$f":"IF(COUNTIF($A$2:A14,A14)=1,ROW()-1,\"\")","v":""},"","",{"$f":"IFERROR(Table2[[#This Row],[Swine requiment ]],\"\")","v":"Finisher"},13,{"$f":"IF(COUNTIF($F$2:F14,F14)=1,ROW()-1,\"\")","v":""},25,0]
[{"$f":"IFERROR(Table2[[#This Row],[Scénarios]],\"\")","v":"Single_Feeding"},14,{"$f":"IF(COUNTIF($A$2:A15,A15)=1,ROW()-1,\"\")","v":14},"","",{"$f":"IFERROR(Table2[[#This Row],[Swine requiment ]],\"\")","v":"Grower"},14,{"$f":"IF(COUNTIF($F$2:F15,F15)=1,ROW()-1,\"\")","v":""},"",""]
[{"$f":"IFERROR(Table2[[#This Row],[Scénarios]],\"\")","v":"Single_Feeding"},15,{"$f":"IF(COUNTIF($A$2:A16,A16)=1,ROW()-1,\"\")","v":""},"","",{"$f":"IFERROR(Table2[[#This Row],[Swine requiment ]],\"\")","v":"Piglets"},15,{"$f":"IF(COUNTIF($F$2:F16,F16)=1,ROW()-1,\"\")","v":""},"",""]
[{"$f":"IFERROR(Table2[[#This Row],[Scénarios]],\"\")","v":"Single_Feeding"},16,{"$f":"IF(COUNTIF($A$2:A17,A17)=1,ROW()-1,\"\")","v":""},"","",{"$f":"IFERROR(Table2[[#This Row],[Swine requiment ]],\"\")","v":"Weaners"},16,{"$f":"IF(COUNTIF($F$2:F17,F17)=1,ROW()-1,\"\")","v":""},"",""]
[{"$f":"IFERROR(Table2[[#This Row],[Scénarios]],\"\")","v":"Sow_Single_Feeding"},17,{"$f":"IF(COUNTIF($A$2:A18,A18)=1,ROW()-1,\"\")","v":17},"","",{"$f":"IFERROR(Table2[[#This Row],[Swine requiment ]],\"\")","v":"Lactation"},17,{"$f":"IF(COUNTIF($F$2:F18,F18)=1,ROW()-1,\"\")","v":17},"",""]
[{"$f":"IFERROR(Table2[[#This Row],[Scénarios]],\"\")","v":"Sows_2_Phasis"},18,{"$f":"IF(COUNTIF($A$2:A19,A19)=1,ROW()-1,\"\")","v":18},"","",{"$f":"IFERROR(Table2[[#This Row],[Swine requiment ]],\"\")","v":"Gestation"},18,{"$f":"IF(COUNTIF($F$2:F19,F19)=1,ROW()-1,\"\")","v":18},"",""]
[{"$f":"IFERROR(Table2[[#This Row],[Scénarios]],\"\")","v":"Sows_2_Phasis"},19,{"$f":"IF(COUNTIF($A$2:A20,A20)=1,ROW()-1,\"\")","v":""},"","",{"$f":"IFERROR(Table2[[#This Row],[Swine requiment ]],\"\")","v":"Lactation"},19,{"$f":"IF(COUNTIF($F$2:F20,F20)=1,ROW()-1,\"\")","v":""},"",""]
[{"$f":"IFERROR(Table2[[#This Row],[Scénarios]],\"\")","v":"Sows_4_Phasis"},20,{"$f":"IF(COUNTIF($A$2:A21,A21)=1,ROW()-1,\"\")","v":20},"","",{"$f":"IFERROR(Table2[[#This Row],[Swine requiment ]],\"\")","v":"Early gestation"},20,{"$f":"IF(COUNTIF($F$2:F21,F21)=1,ROW()-1,\"\")","v":20},"",""]
[{"$f":"IFERROR(Table2[[#This Row],[Scénarios]],\"\")","v":"Sows_4_Phasis"},21,{"$f":"IF(COUNTIF($A$2:A22,A22)=1,ROW()-1,\"\")","v":""},"","",{"$f":"IFERROR(Table2[[#This Row],[Swine requiment ]],\"\")","v":"Late gestation"},21,{"$f":"IF(COUNTIF($F$2:F22,F22)=1,ROW()-1,\"\")","v":21},"",""]
[{"$f":"IFERROR(Table2[[#This Row],[Scénarios]],\"\")","v":"Sows_4_Phasis"},22,{"$f":"IF(COUNTIF($A$2:A23,A23)=1,ROW()-1,\"\")","v":""},"","",{"$f":"IFERROR(Table2[[#This Row],[Swine requiment ]],\"\")","v":"Early lactation"},22,{"$f":"IF(COUNTIF($F$2:F23,F23)=1,ROW()-1,\"\")","v":22},"",""]
[{"$f":"IFERROR(Table2[[#This Row],[Scénarios]],\"\")","v":"Sows_4_Phasis"},23,{"$f":"IF(COUNTIF($A$2:A24,A24)=1,ROW()-1,\"\")","v":""},"","",{"$f":"IFERROR(Table2[[#This Row],[Swine requiment ]],\"\")","v":"Late lactation"},23,{"$f":"IF(COUNTIF($F$2:F24,F24)=1,ROW()-1,\"\")","v":23},"",""]
[{"$f":"IFERROR(Table2[[#This Row],[Scénarios]],\"\")","v":"Pigs fatteners Alfala 1 kg "},24,{"$f":"IF(COUNTIF($A$2:A25,A25)=1,ROW()-1,\"\")","v":24},"","",{"$f":"IFERROR(Table2[[#This Row],[Swine requiment ]],\"\")","v":"Finisher"},24,{"$f":"IF(COUNTIF($F$2:F25,F25)=1,ROW()-1,\"\")","v":""},"",""]
[{"$f":"IFERROR(Table2[[#This Row],[Scénarios]],\"\")","v":0},25,{"$f":"IF(COUNTIF($A$2:A26,A26)=1,ROW()-1,\"\")","v":25},"","",{"$f":"IFERROR(Table2[[#This Row],[Swine requiment ]],\"\")","v":0},25,{"$f":"IF(COUNTIF($F$2:F26,F26)=1,ROW()-1,\"\")","v":25},"",""]
[{"$f":"IFERROR(Table2[[#This Row],[Scénarios]],\"\")","v":0},26,{"$f":"IF(COUNTIF($A$2:A27,A27)=1,ROW()-1,\"\")","v":""},"","",{"$f":"IFERROR(Table2[[#This Row],[Swine requiment ]],\"\")","v":0},26,{"$f":"IF(COUNTIF($F$2:F27,F27)=1,ROW()-1,\"\")","v":""},"",""]
[{"$f":"IFERROR(Table2[[#This Row],[Scénarios]],\"\")","v":0},27,{"$f":"IF(COUNTIF($A$2:A28,A28)=1,ROW()-1,\"\")","v":""},"","",{"$f":"IFERROR(Table2[[#This Row],[Swine requiment ]],\"\")","v":0},27,{"$f":"IF(COUNTIF($F$2:F28,F28)=1,ROW()-1,\"\")","v":""},"",""]
[{"$f":"IFERROR(Table2[[#This Row],[Scénarios]],\"\")","v":0},28,{"$f":"IF(COUNTIF($A$2:A29,A29)=1,ROW()-1,\"\")","v":""},"","",{"$f":"IFERROR(Table2[[#This Row],[Swine requiment ]],\"\")","v":0},28,{"$f":"IF(COUNTIF($F$2:F29,F29)=1,ROW()-1,\"\")","v":""},"",""]
[{"$f":"IFERROR(Table2[[#This Row],[Scénarios]],\"\")","v":0},29,{"$f":"IF(COUNTIF($A$2:A30,A30)=1,ROW()-1,\"\")","v":""},"","",{"$f":"IFERROR(Table2[[#This Row],[Swine requiment ]],\"\")","v":0},29,{"$f":"IF(COUNTIF($F$2:F30,F30)=1,ROW()-1,\"\")","v":""},"",""]
[{"$f":"IFERROR(Table2[[#This Row],[Scénarios]],\"\")","v":0},30,{"$f":"IF(COUNTIF($A$2:A31,A31)=1,ROW()-1,\"\")","v":""},"","",{"$f":"IFERROR(Table2[[#This Row],[Swine requiment ]],\"\")","v":0},30,{"$f":"IF(COUNTIF($F$2:F31,F31)=1,ROW()-1,\"\")","v":""},"",""]
[{"$f":"IFERROR(Table2[[#This Row],[Scénarios]],\"\")","v":0},31,{"$f":"IF(COUNTIF($A$2:A32,A32)=1,ROW()-1,\"\")","v":""},"","",{"$f":"IFERROR(Table2[[#This Row],[Swine requiment ]],\"\")","v":0},31,{"$f":"IF(COUNTIF($F$2:F32,F32)=1,ROW()-1,\"\")","v":""},"",""]
[{"$f":"IFERROR(Table2[[#This Row],[Scénarios]],\"\")","v":0},32,{"$f":"IF(COUNTIF($A$2:A33,A33)=1,ROW()-1,\"\")","v":""},"","",{"$f":"IFERROR(Table2[[#This Row],[Swine requiment ]],\"\")","v":0},32,{"$f":"IF(COUNTIF($F$2:F33,F33)=1,ROW()-1,\"\")","v":""},"",""]
[{"$f":"IFERROR(Table2[[#This Row],[Scénarios]],\"\")","v":0},33,{"$f":"IF(COUNTIF($A$2:A34,A34)=1,ROW()-1,\"\")","v":""},"","",{"$f":"IFERROR(Table2[[#This Row],[Swine requiment ]],\"\")","v":0},33,{"$f":"IF(COUNTIF($F$2:F34,F34)=1,ROW()-1,\"\")","v":""},"",""]
[{"$f":"IFERROR(Table2[[#This Row],[Scénarios]],\"\")","v":0},34,{"$f":"IF(COUNTIF($A$2:A35,A35)=1,ROW()-1,\"\")","v":""},"","",{"$f":"IFERROR(Table2[[#This Row],[Swine requiment ]],\"\")","v":0},34,{"$f":"IF(COUNTIF($F$2:F35,F35)=1,ROW()-1,\"\")","v":""},"",""]
[{"$f":"IFERROR(Table2[[#This Row],[Scénarios]],\"\")","v":0},35,{"$f":"IF(COUNTIF($A$2:A36,A36)=1,ROW()-1,\"\")","v":""},"","",{"$f":"IFERROR(Table2[[#This Row],[Swine requiment ]],\"\")","v":0},35,{"$f":"IF(COUNTIF($F$2:F36,F36)=1,ROW()-1,\"\")","v":""},"",""]
[{"$f":"IFERROR(Table2[[#This Row],[Scénarios]],\"\")","v":0},36,{"$f":"IF(COUNTIF($A$2:A37,A37)=1,ROW()-1,\"\")","v":""},"","",{"$f":"IFERROR(Table2[[#This Row],[Swine requiment ]],\"\")","v":0},36,{"$f":"IF(COUNTIF($F$2:F37,F37)=1,ROW()-1,\"\")","v":""},"",""]
[{"$f":"IFERROR(Table2[[#This Row],[Scénarios]],\"\")","v":0},37,{"$f":"IF(COUNTIF($A$2:A38,A38)=1,ROW()-1,\"\")","v":""},"","",{"$f":"IFERROR(Table2[[#This Row],[Swine requiment ]],\"\")","v":0},37,{"$f":"IF(COUNTIF($F$2:F38,F38)=1,ROW()-1,\"\")","v":""},"",""]
[{"$f":"IFERROR(Table2[[#This Row],[Scénarios]],\"\")","v":0},38,{"$f":"IF(COUNTIF($A$2:A39,A39)=1,ROW()-1,\"\")","v":""},"","",{"$f":"IFERROR(Table2[[#This Row],[Swine requiment ]],\"\")","v":0},38,{"$f":"IF(COUNTIF($F$2:F39,F39)=1,ROW()-1,\"\")","v":""},"",""]
[{"$f":"IFERROR(Table2[[#This Row],[Scénarios]],\"\")","v":0},39,{"$f":"IF(COUNTIF($A$2:A40,A40)=1,ROW()-1,\"\")","v":""},"","",{"$f":"IFERROR(Table2[[#This Row],[Swine requiment ]],\"\")","v":0},39,{"$f":"IF(COUNTIF($F$2:F40,F40)=1,ROW()-1,\"\")","v":""},"",""]
[{"$f":"IFERROR(Table2[[#This Row],[Scénarios]],\"\")","v":0},40,{"$f":"IF(COUNTIF($A$2:A41,A41)=1,ROW()-1,\"\")","v":""},"","",{"$f":"IFERROR(Table2[[#This Row],[Swine requiment ]],\"\")","v":0},40,{"$f":"IF(COUNTIF($F$2:F41,F41)=1,ROW()-1,\"\")","v":""},"",""]
[{"$f":"IFERROR(Table2[[#This Row],[Scénarios]],\"\")","v":0},41,{"$f":"IF(COUNTIF($A$2:A42,A42)=1,ROW()-1,\"\")","v":""},"","",{"$f":"IFERROR(Table2[[#This Row],[Swine requiment ]],\"\")","v":0},41,{"$f":"IF(COUNTIF($F$2:F42,F42)=1,ROW()-1,\"\")","v":""},"",""]
[{"$f":"IFERROR(Table2[[#This Row],[Scénarios]],\"\")","v":0},42,{"$f":"IF(COUNTIF($A$2:A43,A43)=1,ROW()-1,\"\")","v":""},"","",{"$f":"IFERROR(Table2[[#This Row],[Swine requiment ]],\"\")","v":0},42,{"$f":"IF(COUNTIF($F$2:F43,F43)=1,ROW()-1,\"\")","v":""},"",""]
[{"$f":"IFERROR(Table2[[#This Row],[Scénarios]],\"\")","v":0},43,{"$f":"IF(COUNTIF($A$2:A44,A44)=1,ROW()-1,\"\")","v":""},"","",{"$f":"IFERROR(Table2[[#This Row],[Swine requiment ]],\"\")","v":0},43,{"$f":"IF(COUNTIF($F$2:F44,F44)=1,ROW()-1,\"\")","v":""},"",""]
[{"$f":"IFERROR(Table2[[#This Row],[Scénarios]],\"\")","v":0},44,{"$f":"IF(COUNTIF($A$2:A45,A45)=1,ROW()-1,\"\")","v":""},"","",{"$f":"IFERROR(Table2[[#This Row],[Swine requiment ]],\"\")","v":0},44,{"$f":"IF(COUNTIF($F$2:F45,F45)=1,ROW()-1,\"\")","v":""},"",""]
[{"$f":"IFERROR(Table2[[#This Row],[Scénarios]],\"\")","v":0},45,{"$f":"IF(COUNTIF($A$2:A46,A46)=1,ROW()-1,\"\")","v":""},"","",{"$f":"IFERROR(Table2[[#This Row],[Swine requiment ]],\"\")","v":0},45,{"$f":"IF(COUNTIF($F$2:F46,F46)=1,ROW()-1,\"\")","v":""},"",""]
[{"$f":"IFERROR(Table2[[#This Row],[Scénarios]],\"\")","v":0},46,{"$f":"IF(COUNTIF($A$2:A47,A47)=1,ROW()-1,\"\")","v":""},"","",{"$f":"IFERROR(Table2[[#This Row],[Swine requiment ]],\"\")","v":0},46,{"$f":"IF(COUNTIF($F$2:F47,F47)=1,ROW()-1,\"\")","v":""},"",""]
[{"$f":"IFERROR(Table2[[#This Row],[Scénarios]],\"\")","v":0},47,{"$f":"IF(COUNTIF($A$2:A48,A48)=1,ROW()-1,\"\")","v":""},"","",{"$f":"IFERROR(Table2[[#This Row],[Swine requiment ]],\"\")","v":0},47,{"$f":"IF(COUNTIF($F$2:F48,F48)=1,ROW()-1,\"\")","v":""},"",""]
[{"$f":"IFERROR(Table2[[#This Row],[Scénarios]],\"\")","v":0},48,{"$f":"IF(COUNTIF($A$2:A49,A49)=1,ROW()-1,\"\")","v":""},"","",{"$f":"IFERROR(Table2[[#This Row],[Swine requiment ]],\"\")","v":0},48,{"$f":"IF(COUNTIF($F$2:F49,F49)=1,ROW()-1,\"\")","v":""},"",""]
[{"$f":"IFERROR(Table2[[#This Row],[Scénarios]],\"\")","v":0},49,{"$f":"IF(COUNTIF($A$2:A50,A50)=1,ROW()-1,\"\")","v":""},"","",{"$f":"IFERROR(Table2[[#This Row],[Swine requiment ]],\"\")","v":0},49,{"$f":"IF(COUNTIF($F$2:F50,F50)=1,ROW()-1,\"\")","v":""},"",""]
[{"$f":"IFERROR(Table2[[#This Row],[Scénarios]],\"\")","v":0},50,{"$f":"IF(COUNTIF($A$2:A51,A51)=1,ROW()-1,\"\")","v":""},"","",{"$f":"IFERROR(Table2[[#This Row],[Swine requiment ]],\"\")","v":0},50,{"$f":"IF(COUNTIF($F$2:F51,F51)=1,ROW()-1,\"\")","v":""},"",""]
[{"$f":"IFERROR(Table2[[#This Row],[Scénarios]],\"\")","v":0},51,{"$f":"IF(COUNTIF($A$2:A52,A52)=1,ROW()-1,\"\")","v":""},"","",{"$f":"IFERROR(Table2[[#This Row],[Swine requiment ]],\"\")","v":0},51,{"$f":"IF(COUNTIF($F$2:F52,F52)=1,ROW()-1,\"\")","v":""},"",""]
[{"$f":"IFERROR(Table2[[#This Row],[Scénarios]],\"\")","v":0},52,{"$f":"IF(COUNTIF($A$2:A53,A53)=1,ROW()-1,\"\")","v":""},"","",{"$f":"IFERROR(Table2[[#This Row],[Swine requiment ]],\"\")","v":0},52,{"$f":"IF(COUNTIF($F$2:F53,F53)=1,ROW()-1,\"\")","v":""},"",""]
[{"$f":"IFERROR(Table2[[#This Row],[Scénarios]],\"\")","v":0},53,{"$f":"IF(COUNTIF($A$2:A54,A54)=1,ROW()-1,\"\")","v":""},"","",{"$f":"IFERROR(Table2[[#This Row],[Swine requiment ]],\"\")","v":0},53,{"$f":"IF(COUNTIF($F$2:F54,F54)=1,ROW()-1,\"\")","v":""},"",""]
[{"$f":"IFERROR(Table2[[#This Row],[Scénarios]],\"\")","v":0},54,{"$f":"IF(COUNTIF($A$2:A55,A55)=1,ROW()-1,\"\")","v":""},"","",{"$f":"IFERROR(Table2[[#This Row],[Swine requiment ]],\"\")","v":0},54,{"$f":"IF(COUNTIF($F$2:F55,F55)=1,ROW()-1,\"\")","v":""},"",""]
[{"$f":"IFERROR(Table2[[#This Row],[Scénarios]],\"\")","v":0},55,{"$f":"IF(COUNTIF($A$2:A56,A56)=1,ROW()-1,\"\")","v":""},"","",{"$f":"IFERROR(Table2[[#This Row],[Swine requiment ]],\"\")","v":0},55,{"$f":"IF(COUNTIF($F$2:F56,F56)=1,ROW()-1,\"\")","v":""},"",""]
[{"$f":"IFERROR(Table2[[#This Row],[Scénarios]],\"\")","v":0},56,{"$f":"IF(COUNTIF($A$2:A57,A57)=1,ROW()-1,\"\")","v":""},"","",{"$f":"IFERROR(Table2[[#This Row],[Swine requiment ]],\"\")","v":0},56,{"$f":"IF(COUNTIF($F$2:F57,F57)=1,ROW()-1,\"\")","v":""},"",""]
[{"$f":"IFERROR(Table2[[#This Row],[Scénarios]],\"\")","v":0},57,{"$f":"IF(COUNTIF($A$2:A58,A58)=1,ROW()-1,\"\")","v":""},"","",{"$f":"IFERROR(Table2[[#This Row],[Swine requiment ]],\"\")","v":0},57,{"$f":"IF(COUNTIF($F$2:F58,F58)=1,ROW()-1,\"\")","v":""},"",""]
[{"$f":"IFERROR(Table2[[#This Row],[Scénarios]],\"\")","v":0},58,{"$f":"IF(COUNTIF($A$2:A59,A59)=1,ROW()-1,\"\")","v":""},"","",{"$f":"IFERROR(Table2[[#This Row],[Swine requiment ]],\"\")","v":0},58,{"$f":"IF(COUNTIF($F$2:F59,F59)=1,ROW()-1,\"\")","v":""},"",""]
[{"$f":"IFERROR(Table2[[#This Row],[Scénarios]],\"\")","v":0},59,{"$f":"IF(COUNTIF($A$2:A60,A60)=1,ROW()-1,\"\")","v":""},"","",{"$f":"IFERROR(Table2[[#This Row],[Swine requiment ]],\"\")","v":0},59,{"$f":"IF(COUNTIF($F$2:F60,F60)=1,ROW()-1,\"\")","v":""},"",""]
[{"$f":"IFERROR(Table2[[#This Row],[Scénarios]],\"\")","v":0},60,{"$f":"IF(COUNTIF($A$2:A61,A61)=1,ROW()-1,\"\")","v":""},"","",{"$f":"IFERROR(Table2[[#This Row],[Swine requiment ]],\"\")","v":0},60,{"$f":"IF(COUNTIF($F$2:F61,F61)=1,ROW()-1,\"\")","v":""},"",""]
[{"$f":"IFERROR(Table2[[#This Row],[Scénarios]],\"\")","v":0},61,{"$f":"IF(COUNTIF($A$2:A62,A62)=1,ROW()-1,\"\")","v":""},"","",{"$f":"IFERROR(Table2[[#This Row],[Swine requiment ]],\"\")","v":0},61,{"$f":"IF(COUNTIF($F$2:F62,F62)=1,ROW()-1,\"\")","v":""},"",""]
[{"$f":"IFERROR(Table2[[#This Row],[Scénarios]],\"\")","v":0},62,{"$f":"IF(COUNTIF($A$2:A63,A63)=1,ROW()-1,\"\")","v":""},"","",{"$f":"IFERROR(Table2[[#This Row],[Swine requiment ]],\"\")","v":0},62,{"$f":"IF(COUNTIF($F$2:F63,F63)=1,ROW()-1,\"\")","v":""},"",""]
[{"$f":"IFERROR(Table2[[#This Row],[Scénarios]],\"\")","v":0},63,{"$f":"IF(COUNTIF($A$2:A64,A64)=1,ROW()-1,\"\")","v":""},"","",{"$f":"IFERROR(Table2[[#This Row],[Swine requiment ]],\"\")","v":0},63,{"$f":"IF(COUNTIF($F$2:F64,F64)=1,ROW()-1,\"\")","v":""},"",""]
[{"$f":"IFERROR(Table2[[#This Row],[Scénarios]],\"\")","v":0},64,{"$f":"IF(COUNTIF($A$2:A65,A65)=1,ROW()-1,\"\")","v":""},"","",{"$f":"IFERROR(Table2[[#This Row],[Swine requiment ]],\"\")","v":0},64,{"$f":"IF(COUNTIF($F$2:F65,F65)=1,ROW()-1,\"\")","v":""},"",""]
[{"$f":"IFERROR(Table2[[#This Row],[Scénarios]],\"\")","v":0},65,{"$f":"IF(COUNTIF($A$2:A66,A66)=1,ROW()-1,\"\")","v":""},"","",{"$f":"IFERROR(Table2[[#This Row],[Swine requiment ]],\"\")","v":0},65,{"$f":"IF(COUNTIF($F$2:F66,F66)=1,ROW()-1,\"\")","v":""},"",""]
[{"$f":"IFERROR(Table2[[#This Row],[Scénarios]],\"\")","v":0},{"$f":"ROW()-1","v":66},{"$f":"IF(COUNTIF($A$2:A67,A67)=1,ROW()-1,\"\")","v":""},{"$f":"IFERROR(SMALL(C:C,B67),\"\")","v":""},{"$f":"IFERROR(INDEX($A$2:$A$99,D67),\"\")","v":""},{"$f":"IFERROR(Table2[[#This Row],[Swine requiment ]],\"\")","v":0},{"$f":"ROW()-1","v":66},{"$f":"IF(COUNTIF($F$2:F67,F67)=1,ROW()-1,\"\")","v":""},{"$f":"IFERROR(SMALL(H:H,G67),\"\")","v":""},{"$f":"IFERROR(INDEX($F$2:$F$99,I67),\"\")","v":""}]
[{"$f":"IFERROR(Table2[[#This Row],[Scénarios]],\"\")","v":0},67,{"$f":"IF(COUNTIF($A$2:A68,A68)=1,ROW()-1,\"\")","v":""},"","",{"$f":"IFERROR(Table2[[#This Row],[Swine requiment ]],\"\")","v":0},67,{"$f":"IF(COUNTIF($F$2:F68,F68)=1,ROW()-1,\"\")","v":""},"",""]
[{"$f":"IFERROR(Table2[[#This Row],[Scénarios]],\"\")","v":0},68,{"$f":"IF(COUNTIF($A$2:A69,A69)=1,ROW()-1,\"\")","v":""},"","",{"$f":"IFERROR(Table2[[#This Row],[Swine requiment ]],\"\")","v":0},68,{"$f":"IF(COUNTIF($F$2:F69,F69)=1,ROW()-1,\"\")","v":""},"",""]
[{"$f":"IFERROR(Table2[[#This Row],[Scénarios]],\"\")","v":0},69,{"$f":"IF(COUNTIF($A$2:A70,A70)=1,ROW()-1,\"\")","v":""},"","",{"$f":"IFERROR(Table2[[#This Row],[Swine requiment ]],\"\")","v":0},69,{"$f":"IF(COUNTIF($F$2:F70,F70)=1,ROW()-1,\"\")","v":""},"",""]
[{"$f":"IFERROR(Table2[[#This Row],[Scénarios]],\"\")","v":0},70,{"$f":"IF(COUNTIF($A$2:A71,A71)=1,ROW()-1,\"\")","v":""},"","",{"$f":"IFERROR(Table2[[#This Row],[Swine requiment ]],\"\")","v":0},70,{"$f":"IF(COUNTIF($F$2:F71,F71)=1,ROW()-1,\"\")","v":""},"",""]
[{"$f":"IFERROR(Table2[[#This Row],[Scénarios]],\"\")","v":0},71,{"$f":"IF(COUNTIF($A$2:A72,A72)=1,ROW()-1,\"\")","v":""},"","",{"$f":"IFERROR(Table2[[#This Row],[Swine requiment ]],\"\")","v":0},71,{"$f":"IF(COUNTIF($F$2:F72,F72)=1,ROW()-1,\"\")","v":""},"",""]
[{"$f":"IFERROR(Table2[[#This Row],[Scénarios]],\"\")","v":0},72,{"$f":"IF(COUNTIF($A$2:A73,A73)=1,ROW()-1,\"\")","v":""},"","",{"$f":"IFERROR(Table2[[#This Row],[Swine requiment ]],\"\")","v":0},72,{"$f":"IF(COUNTIF($F$2:F73,F73)=1,ROW()-1,\"\")","v":""},"",""]
[{"$f":"IFERROR(Table2[[#This Row],[Scénarios]],\"\")","v":0},73,{"$f":"IF(COUNTIF($A$2:A74,A74)=1,ROW()-1,\"\")","v":""},"","",{"$f":"IFERROR(Table2[[#This Row],[Swine requiment ]],\"\")","v":0},73,{"$f":"IF(COUNTIF($F$2:F74,F74)=1,ROW()-1,\"\")","v":""},"",""]
[{"$f":"IFERROR(Table2[[#This Row],[Scénarios]],\"\")","v":0},74,{"$f":"IF(COUNTIF($A$2:A75,A75)=1,ROW()-1,\"\")","v":""},"","",{"$f":"IFERROR(Table2[[#This Row],[Swine requiment ]],\"\")","v":0},74,{"$f":"IF(COUNTIF($F$2:F75,F75)=1,ROW()-1,\"\")","v":""},"",""]
[{"$f":"IFERROR(Table2[[#This Row],[Scénarios]],\"\")","v":0},75,{"$f":"IF(COUNTIF($A$2:A76,A76)=1,ROW()-1,\"\")","v":""},"","",{"$f":"IFERROR(Table2[[#This Row],[Swine requiment ]],\"\")","v":0},75,{"$f":"IF(COUNTIF($F$2:F76,F76)=1,ROW()-1,\"\")","v":""},"",""]
[{"$f":"IFERROR(Table2[[#This Row],[Scénarios]],\"\")","v":0},76,{"$f":"IF(COUNTIF($A$2:A77,A77)=1,ROW()-1,\"\")","v":""},"","",{"$f":"IFERROR(Table2[[#This Row],[Swine requiment ]],\"\")","v":0},76,{"$f":"IF(COUNTIF($F$2:F77,F77)=1,ROW()-1,\"\")","v":""},"",""]
[{"$f":"IFERROR(Table2[[#This Row],[Scénarios]],\"\")","v":0},77,{"$f":"IF(COUNTIF($A$2:A78,A78)=1,ROW()-1,\"\")","v":""},"","",{"$f":"IFERROR(Table2[[#This Row],[Swine requiment ]],\"\")","v":0},77,{"$f":"IF(COUNTIF($F$2:F78,F78)=1,ROW()-1,\"\")","v":""},"",""]
[{"$f":"IFERROR(Table2[[#This Row],[Scénarios]],\"\")","v":0},78,{"$f":"IF(COUNTIF($A$2:A79,A79)=1,ROW()-1,\"\")","v":""},"","",{"$f":"IFERROR(Table2[[#This Row],[Swine requiment ]],\"\")","v":0},78,{"$f":"IF(COUNTIF($F$2:F79,F79)=1,ROW()-1,\"\")","v":""},"",""]
[{"$f":"IFERROR(Table2[[#This Row],[Scénarios]],\"\")","v":0},79,{"$f":"IF(COUNTIF($A$2:A80,A80)=1,ROW()-1,\"\")","v":""},"","",{"$f":"IFERROR(Table2[[#This Row],[Swine requiment ]],\"\")","v":0},79,{"$f":"IF(COUNTIF($F$2:F80,F80)=1,ROW()-1,\"\")","v":""},"",""]
[{"$f":"IFERROR(Table2[[#This Row],[Scénarios]],\"\")","v":0},80,{"$f":"IF(COUNTIF($A$2:A81,A81)=1,ROW()-1,\"\")","v":""},"","",{"$f":"IFERROR(Table2[[#This Row],[Swine requiment ]],\"\")","v":0},80,{"$f":"IF(COUNTIF($F$2:F81,F81)=1,ROW()-1,\"\")","v":""},"",""]
[{"$f":"IFERROR(Table2[[#This Row],[Scénarios]],\"\")","v":0},81,{"$f":"IF(COUNTIF($A$2:A82,A82)=1,ROW()-1,\"\")","v":""},"","",{"$f":"IFERROR(Table2[[#This Row],[Swine requiment ]],\"\")","v":0},81,{"$f":"IF(COUNTIF($F$2:F82,F82)=1,ROW()-1,\"\")","v":""},"",""]
[{"$f":"IFERROR(Table2[[#This Row],[Scénarios]],\"\")","v":0},82,{"$f":"IF(COUNTIF($A$2:A83,A83)=1,ROW()-1,\"\")","v":""},"","",{"$f":"IFERROR(Table2[[#This Row],[Swine requiment ]],\"\")","v":0},82,{"$f":"IF(COUNTIF($F$2:F83,F83)=1,ROW()-1,\"\")","v":""},"",""]
[{"$f":"IFERROR(Table2[[#This Row],[Scénarios]],\"\")","v":0},83,{"$f":"IF(COUNTIF($A$2:A84,A84)=1,ROW()-1,\"\")","v":""},"","",{"$f":"IFERROR(Table2[[#This Row],[Swine requiment ]],\"\")","v":0},83,{"$f":"IF(COUNTIF($F$2:F84,F84)=1,ROW()-1,\"\")","v":""},"",""]
[{"$f":"IFERROR(Table2[[#This Row],[Scénarios]],\"\")","v":0},84,{"$f":"IF(COUNTIF($A$2:A85,A85)=1,ROW()-1,\"\")","v":""},"","",{"$f":"IFERROR(Table2[[#This Row],[Swine requiment ]],\"\")","v":0},84,{"$f":"IF(COUNTIF($F$2:F85,F85)=1,ROW()-1,\"\")","v":""},"",""]
[{"$f":"IFERROR(Table2[[#This Row],[Scénarios]],\"\")","v":0},85,{"$f":"IF(COUNTIF($A$2:A86,A86)=1,ROW()-1,\"\")","v":""},"","",{"$f":"IFERROR(Table2[[#This Row],[Swine requiment ]],\"\")","v":0},85,{"$f":"IF(COUNTIF($F$2:F86,F86)=1,ROW()-1,\"\")","v":""},"",""]
[{"$f":"IFERROR(Table2[[#This Row],[Scénarios]],\"\")","v":0},86,{"$f":"IF(COUNTIF($A$2:A87,A87)=1,ROW()-1,\"\")","v":""},"","",{"$f":"IFERROR(Table2[[#This Row],[Swine requiment ]],\"\")","v":0},86,{"$f":"IF(COUNTIF($F$2:F87,F87)=1,ROW()-1,\"\")","v":""},"",""]
[{"$f":"IFERROR(Table2[[#This Row],[Scénarios]],\"\")","v":0},87,{"$f":"IF(COUNTIF($A$2:A88,A88)=1,ROW()-1,\"\")","v":""},"","",{"$f":"IFERROR(Table2[[#This Row],[Swine requiment ]],\"\")","v":0},87,{"$f":"IF(COUNTIF($F$2:F88,F88)=1,ROW()-1,\"\")","v":""},"",""]
[{"$f":"IFERROR(Table2[[#This Row],[Scénarios]],\"\")","v":0},88,{"$f":"IF(COUNTIF($A$2:A89,A89)=1,ROW()-1,\"\")","v":""},"","",{"$f":"IFERROR(Table2[[#This Row],[Swine requiment ]],\"\")","v":0},88,{"$f":"IF(COUNTIF($F$2:F89,F89)=1,ROW()-1,\"\")","v":""},"",""]
[{"$f":"IFERROR(Table2[[#This Row],[Scénarios]],\"\")","v":0},89,{"$f":"IF(COUNTIF($A$2:A90,A90)=1,ROW()-1,\"\")","v":""},"","",{"$f":"IFERROR(Table2[[#This Row],[Swine requiment ]],\"\")","v":0},89,{"$f":"IF(COUNTIF($F$2:F90,F90)=1,ROW()-1,\"\")","v":""},"",""]
[{"$f":"IFERROR(Table2[[#This Row],[Scénarios]],\"\")","v":0},90,{"$f":"IF(COUNTIF($A$2:A91,A91)=1,ROW()-1,\"\")","v":""},"","",{"$f":"IFERROR(Table2[[#This Row],[Swine requiment ]],\"\")","v":0},90,{"$f":"IF(COUNTIF($F$2:F91,F91)=1,ROW()-1,\"\")","v":""},"",""]
[{"$f":"IFERROR(Table2[[#This Row],[Scénarios]],\"\")","v":0},91,{"$f":"IF(COUNTIF($A$2:A92,A92)=1,ROW()-1,\"\")","v":""},"","",{"$f":"IFERROR(Table2[[#This Row],[Swine requiment ]],\"\")","v":0},91,{"$f":"IF(COUNTIF($F$2:F92,F92)=1,ROW()-1,\"\")","v":""},"",""]
[{"$f":"IFERROR(Table2[[#This Row],[Scénarios]],\"\")","v":0},92,{"$f":"IF(COUNTIF($A$2:A93,A93)=1,ROW()-1,\"\")","v":""},"","",{"$f":"IFERROR(Table2[[#This Row],[Swine requiment ]],\"\")","v":0},92,{"$f":"IF(COUNTIF($F$2:F93,F93)=1,ROW()-1,\"\")","v":""},"",""]
[{"$f":"IFERROR(Table2[[#This Row],[Scénarios]],\"\")","v":0},93,{"$f":"IF(COUNTIF($A$2:A94,A94)=1,ROW()-1,\"\")","v":""},"","",{"$f":"IFERROR(Table2[[#This Row],[Swine requiment ]],\"\")","v":0},93,{"$f":"IF(COUNTIF($F$2:F94,F94)=1,ROW()-1,\"\")","v":""},"",""]
[{"$f":"IFERROR(Table2[[#This Row],[Scénarios]],\"\")","v":0},94,{"$f":"IF(COUNTIF($A$2:A95,A95)=1,ROW()-1,\"\")","v":""},"","",{"$f":"IFERROR(Table2[[#This Row],[Swine requiment ]],\"\")","v":0},94,{"$f":"IF(COUNTIF($F$2:F95,F95)=1,ROW()-1,\"\")","v":""},"",""]
[{"$f":"IFERROR(Table2[[#This Row],[Scénarios]],\"\")","v":0},95,{"$f":"IF(COUNTIF($A$2:A96,A96)=1,ROW()-1,\"\")","v":""},"","",{"$f":"IFERROR(Table2[[#This Row],[Swine requiment ]],\"\")","v":0},95,{"$f":"IF(COUNTIF($F$2:F96,F96)=1,ROW()-1,\"\")","v":""},"",""]
[{"$f":"IFERROR(Table2[[#This Row],[Scénarios]],\"\")","v":0},96,{"$f":"IF(COUNTIF($A$2:A97,A97)=1,ROW()-1,\"\")","v":""},"","",{"$f":"IFERROR(Table2[[#This Row],[Swine requiment ]],\"\")","v":0},96,{"$f":"IF(COUNTIF($F$2:F97,F97)=1,ROW()-1,\"\")","v":""},"",""]
[{"$f":"IFERROR(Table2[[#This Row],[Scénarios]],\"\")","v":0},97,{"$f":"IF(COUNTIF($A$2:A98,A98)=1,ROW()-1,\"\")","v":""},"","",{"$f":"IFERROR(Table2[[#This Row],[Swine requiment ]],\"\")","v":0},97,{"$f":"IF(COUNTIF($F$2:F98,F98)=1,ROW()-1,\"\")","v":""},"",""]
[{"$f":"IFERROR(Table2[[#This Row],[Scénarios]],\"\")","v":0},98,{"$f":"IF(COUNTIF($A$2:A99,A99)=1,ROW()-1,\"\")","v":""},"","",{"$f":"IFERROR(Table2[[#This Row],[Swine requiment ]],\"\")","v":0},98,{"$f":"IF(COUNTIF($F$2:F99,F99)=1,ROW()-1,\"\")","v":""},"",""]
[{"$f":"IFERROR(Table2[[#This Row],[Scénarios]],\"\")","v":0},99,{"$f":"IF(COUNTIF($A$2:A100,A100)=1,ROW()-1,\"\")","v":""},"","",{"$f":"IFERROR(Table2[[#This Row],[Swine requiment ]],\"\")","v":0},99,{"$f":"IF(COUNTIF($F$2:F100,F100)=1,ROW()-1,\"\")","v":""},"",""]